Home > Error Occurred > An Error Occurred While Reading Or Writing To A File

An Error Occurred While Reading Or Writing To A File

Contents

cheers,v Applies to Xceed FTP for .NET. dennisblue40 Mar 9, 2012 9:01 PM (in response to Barbara B.) Via System Preferences - Sharing. Re: Error Message: An error occurred while reading files or writing files to disc... Not a great solution but a lot quicker than changing each picture one by one. 1 person found this helpful Like Show 0 Likes(0) Actions Go to original post Actions More navigate here

Re: Error Message: An error occurred while reading files or writing files to disc... This is the error: Xceed.Ftp.FtpIOException: An error occurred while reading from or writing to the data channel. --> System.IO.IOException: I/O error occurred.at Xceed.Utils.Security.Ssl.SecureNetworkStream.BeginWrite(Byte[] buffer, Int32 offset, Int32 size, AsyncCallback callback, Object In the dialog that appears, check "Automatically fix file system errors" and "Scan for and attempt recovery of bad sectors." Click Start. Posted by panik (had 414 views) User (Old forums)Member December 3, 2004 at 5:25 am Post count: 23065 #20664 Hi, I have closed down on where the error exactly happens.I am https://forums.adobe.com/thread/973461

An Error Occurred While Writing A Trace Event To The File

Error code: 0x40003 Path = "C:/Users/ali.oksuz/Belgelerim", $module = "disk_bundle_vs_43909" Tag: 0xCE542E14DA2039AF Error occurred while writing to the file. Can an opponent folding make you go from probable winner to probable loser? Legal. How?

dennisblue40 Mar 11, 2012 4:37 PM (in response to dennisblue40) Tried that, it didn't work either. Imported from legacy forums. Where does the term "Praise the Sun" come from? An Error Occurred While Reading The Flp File It May Be Corrupted Or Some Plugin Where do I find online bookshelves with ebooks or PDFs written in Esperanto?

All Product Documentation Frequently asked questions by product Acronis Backup 12 FAQ Acronis Backup 11.7 FAQ Acronis Backup & Recovery FAQ Acronis True Image 2017 FAQ Acronis True Image 2017 Mac: We recommend testing on another hard drive, but you can also try installing Steam in another folder such as C:\Steam\ We also recommend redownloading the game instead of using your existing My environment: virtulized W2K8 R2 Data Center OS, TMG standard, in a back firewall configuration to support a reverse proxy authentication for a Sharepoint Farm I was able to successfully configure more stack exchange communities company blog Stack Exchange Inbox Reputation and Badges sign up log in tour help Tour Start here for a quick overview of the site Help Center Detailed

Error code: 0x40003 Path = "C:/Users/ali.oksuz/Belgelerim", $module = "disk_bundle_vs_43909" Tag: 0xCE542E14DA203A20 Error occurred while backing up. An Error Occurred While Reading The App.config File Error code: 0x40003 $module = "disk_bundle_vs_43909" Tag: 0xCE542E14DA203B5F Error occurred while writing to the file. It always happens after the first number of files has been uploaded. Like Show 0 Likes(0) Actions 6.

An Error Occurred While Writing A Trace Event To The File Mssqlserverolapservice

at org.apache.hadoop.hive.ql.exec.ScriptOperator.processOp(ScriptOperator.java:446) at org.apache.hadoop.hive.ql.exec.Operator.forward(Operator.java:815) at org.apache.hadoop.hive.ql.exec.SelectOperator.processOp(SelectOperator.java:85) at org.apache.hadoop.hive.ql.exec.Operator.forward(Operator.java:815) at org.apache.hadoop.hive.ql.exec.TableScanOperator.processOp(TableScanOperator.java:95) at org.apache.hadoop.hive.ql.exec.MapOperator$MapOpCtx.forward(MapOperator.java:159) at org.apache.hadoop.hive.ql.exec.MapOperator.process(MapOperator.java:524) ... 9 more Caused by: java.io.IOException: The pipe has been ended at java.io.FileOutputStream.writeBytes(Native Method) at java.io.FileOutputStream.write(FileOutputStream.java:345) at http://www.ibm.com/support/knowledgecenter/SSFTN5_8.5.7/com.ibm.wbpm.ref.doc/LFCOR.html Error code: 0x40019 $module = "disk_bundle_vs_43909" Tag: 0xCE542E14DA203BA9 Error occurred while writing to the file. An Error Occurred While Writing A Trace Event To The File Barbara B. An Error Occurred While Writing A Trace Event To The File Olap asked 6 months ago viewed 101 times Related 0Error occur in HIve Configuration1Facing error with Hive-0.10 while running a query0FAILED: SemanticException org.apache.hadoop.hive.ql.metadata.HiveException while inserting data into Hive partitioned table0org.apache.hadoop.hive.ql.metadata.HiveException: Hive Runtime

A professor has only proofread my paper. check over here I logged when the BeginSendFile method is called and when the SendFileCompleted is being called. Posted by panik (had 5221 views) Author Posts Viewing 5 posts - 1 through 5 (of 5 total) You must be logged in to reply to this topic. Solutions The first step is to verify that your hard drive is in good health and that all bad sectors have been marked as such by the drive. An Error Occurred While Reading The Flp File

I will additionally post the solution here, so that other users could be aware. Posted by panik (had 358 views) User (Old forums)Member December 3, 2004 at 5:45 am Post count: 23065 #20665 I don't really have solution for your problem.I just want to tell By doing it in system prefs? http://svbuckeye.com/error-occurred/an-error-occurred-while-reading-calibration-file.php Mar 10, 2012 1:10 PM (in response to dennisblue40) Hmm.

To file: "file://10.185.1.215\USER_BACKUP\KOCAALI\ALIOKSUZ.progida.local_Archive(1)_2015_03_21_15_09_49_227F2.TIB" Compression: Normal Exclude: Files matching mask Match criterion: *\System Volume Information\*{3808876B-C176-4e48-B7AE-04046E6CC752}; ... An Error Occurred While Reading The File Allocation Table Contact Steam Support Community Help Post or search in Steam Discussions for an answer to your question. More discussions in Photoshop Elements All CommunitiesPhotoshop Elements 9 Replies Latest reply on Mar 13, 2012 5:23 AM by dennisblue40 Error Message: An error occurred while reading files or writing files

Re: Error Message: An error occurred while reading files or writing files to disc...

In case you don't have one you can apply for it at Acronis Web Site. Additional info: -------------------- Error code: 61 Module: 309 LineInfo: 4a8728dc8a1c9510 Fields: $module : mms_vs_43909 Message: Command 'Running backup plan 'ALI.OKSUZ'' has failed. -------------------- Error code: 41 Module: 307 LineInfo: e6792a5ee190dda6 Fields: The disc may be full or there may be a problem with the source media. Error Occurred While Reading Some Of The Iso Files How to determine 10^logn and 3n^2 which grows faster asymptotically?

The software worked fine until I installed it on my laptop, also a Mac, and tried to share files. 1442Views Tags: none (add) This content has been marked as final. If no-one replies, it's best to send the problem directly to Xceed Support. Re: Error Message: An error occurred while reading files or writing files to disc... http://svbuckeye.com/error-occurred/an-error-occurred-error-writing-file-disk-full.php Login Log In Username: Password: Keep me signed in Log In Register new user Forums Home WPF controls .NET libraries WinForms controls ActiveX components General Recent Topics Can Xceed DataGrid run

To do so on Windows: Click Start > (My) Computer Locate the hard drive Steam is installed on. Error code: 0x40019 $module = "disk_bundle_vs_43909" Tag: 0xCE542E14DA203AE2 Error occurred while reading the file. Microsoft Customer Support Microsoft Community Forums Forums Submit Feedback Terms Of Use Knowledge Base Support User login Dear Acronis Customers, please use your Acronis account to login (registered email and password). Why were hatched polygons pours used instead of solid pours in the past?

When I change that permission to RW it allows me to delete the file. Your Answer draft saved draft discarded Sign up or log in Sign up using Google Sign up using Facebook Sign up using Email and Password Post as a guest Name I need to send the content of mail to process it . Skip navigationSign in0Search forums onlySearch forums onlyCancelForums HomeNewsPeopleProduct Menu beginsAdobe Creative CloudDownloading, Installing, Setting UpAdobe Flash PlayerAcrobat ReaderAdobe PhotoshopAdobe Photoshop LightroomAdobe Photoshop ElementsAdobe Dreamweaver Adobe MuseAdobe Animate CCAdobe Premiere ProAdobe After

It may have crashed with an error. Error code: 0x40003 $module = "disk_bundle_vs_43909" Tag: 0xCE542E14DA203B5F Error occurred while writing to the file. All rights reserved.Newsletter|Contact Us|Privacy Statement|Terms of Use|Trademarks|Site Feedback TechNet Products IT Resources Downloads Training Support Products Windows Windows Server System Center Browser   Office Office 365 Exchange Server   SQL Server Re: Error Message: An error occurred while reading files or writing files to disc...

In the Error-checking category, click Check now... Re: Error Message: An error occurred while reading files or writing files to disc... Was Gandalf "meant" to confront the Balrog? February 10, 2016 Support Email [email protected] Telephone 1-450-442-2626 (select option 2) Online Forums Documentation center Sales and contact Email [email protected] (orders & pre-sales) [email protected] (general inquiries) Telephone 1-800-865-2626 (select option 1)

Like Show 0 Likes(0) Actions 7. If you are still seeing this error, move your Steam installation. Re: Error Message: An error occurred while reading files or writing files to disc... Thanks Caused by: org.apache.hadoop.hive.ql.metadata.HiveException: [Error 20001]: An error occurred while reading or writing t o your custom script.

Browse other questions tagged c# hadoop hive or ask your own question. Error code: 0x40001 function = "FSCTL_GET_REPARSE_POINT", $module = "disk_bundle_vs_43909" Tag: 0xA8A1022BD18AE30F Dosya veya dizin bir yeniden inceleme noktası değil Error code: 0xFFF0 code = 2.147.946.790 (0x80071126), $module = "disk_bundle_vs_43909" Tag: 0xBD28FDBD64EDB8EE All Rights Reserved. | Powered by Help | Terms of Use | Privacy Policy and Cookies (UPDATED) | Forum Help | Tips for AskingJive Software Version: 8.0.3.0 , revision: 20160218075410.6eafe9c.release_8.0.3.x Microsoft Error code: 0x40001 function = "FSCTL_GET_REPARSE_POINT", $module = "disk_bundle_vs_43909" Tag: 0xA8A1022BD18AE30F Dosya veya dizin bir yeniden inceleme noktası değil Error code: 0xFFF0 code = 2.147.946.790 (0x80071126), $module = "disk_bundle_vs_43909" Tag: 0xBD28FDBD64EDB8EE