Home > Error Occurred > An Error Occurred On Line 119 While Executing Script

An Error Occurred On Line 119 While Executing Script

Contents

Please type your message and try again. You may have a defective disc.'The Installer encountered an error that caused the installation to fail. Compiler errors are available in /home/hudson/hudson_home/jobs/02-TEST-CI-build/workspace/build/plugins/org.example.test/@dot.log [java] BUILD FAILED [java] /home/hudson/hudson_home/jobs/02-TEST-CI-build/workspace/build-target/eclipse/plugins/org.eclipse.pde.build_3.6.0.v20100603/scripts/build.xml:36: The following error occurred while executing this line: [java] /home/hudson/hudson_home/jobs/02-TEST-CI-build/workspace/build-target/eclipse/plugins/org.eclipse.pde.build_3.6.0.v20100603/scripts/build.xml:105: The following error occurred while executing this line: [java] /home/hudson/hudson_home/jobs/02-TEST-CI-build/workspace/build-target/eclipse/plugins/org.eclipse.pde.build_3.6.0.v20100603/templates/headless-build/customTargets.xml:12: What you will see at the operator console: Open the mom operator console go to the “Alerts\[MITS] Oracle” folder. http://svbuckeye.com/error-occurred/an-error-occurred-on-line-250-while-executing-script.php

Solved Alert on Backward Compatibility Script Errors Posted on 2009-09-09 MS Server OS Windows Server 2003 1 Verified Solution 4 Comments 1,782 Views Last Modified: 2013-11-21 Hi, I'm getting the following Go online, google Java, flash, and microsoft update website (The official one) and get your machine up to date. Just as a service, the Rss option is not working properly in Flock running on Windows 98. This is a well documented condition - even on google - regarding the SWbemServices and the buffer size limitations due to versions of OS, client type and even the versions of

The Following Error Occurred While Executing This Line

How to stop the Internet explorer script error message from showing up: You can tell your Internet Explorer to ignore these errors when they occur and not show you an alert Done Deal! No I want a FREE and simple one!. it only happens in the yahoo.

in the log it looks like a sub-ant call wrote "BUILD FAILED" but then the outermost ant call returned "BUILD SUCCESSFUL".. Terms of Use Updated Privacy Policy Cookie Usage Blog Info Support Carriere Training International Group Info Support Blog Carriere Training International Group Search Search for: Menu Main menu Skip to primary Hide Permalink johanwannheden added a comment - 2010/Aug/02 1:54 AM I did not encounter this problem with Eclipse Galileo - could it maybe be a problem with Helios? Show johanwannheden added a comment - 2010/Sep/07 7:08 AM BTW, if anybody has been facing a similar problem, the error really is a regression in Helios: (will be fixed for 3.6.1)

Read the EULA Subscribe to The Podcast iTunes RSS Join 26,000+ Subscribers See All Posts Copyright © 2016 · Technibble.com - All Rights Reserved · Disclaimer · Terms of Service · Helpful (0) Reply options Link to this post by reymasumoto, reymasumoto Dec 6, 2009 2:06 AM in response to Nick Holmes Level 1 (0 points) Dec 6, 2009 2:06 AM in paulinereeves says September 12, 2008 at 10:46 am when I try to forward or send a message internet explorer stops it. https://groups.google.com/d/topic/microsoft.public.opsmgr.setup/eoTtv1OmAG0 do a commit.

Apple disclaims any and all liability for the acts, omissions and conduct of any third parties in connection with or related to your use of the site. I even have the snow-leopard and thought that it would bring less trouble. hughes net satelite says June 14, 2010 at 10:54 am Excellent read. Only one (non-cascaded) Ant target is called from Hudson:

The Following Error Occurred While Executing This Line Null Returned 1

Suggested Solutions Title # Comments Views Activity A domain user account constantly getting locked out. 25 107 3d Invalid VHD drive error during Microsoft Virtual Machine Converter conversion 3 28 24d http://stackoverflow.com/questions/20989228/tf400744-an-error-occurred-while-executing-the-following-script-workitemtracki BUILD FAILED /space/test4u2/xtests/netbeans-trunk/lib/harness.xml:223: The following error occurred while executing this line: /space/test4u2/cvswork/sunsw/tango/qe-tests/jax-wsa/test/build.xml:49: The following error occurred while executing this line: /space/test4u2/xtests/netbeans-trunk/lib/module_harness.xml:384: The following error occurred while executing this line: /space/test4u2/cvswork/sunsw/tango/qe-tests/jax-wsa/test/build-interop-ejb.xml:119: The The Following Error Occurred While Executing This Line Get 1:1 Help Now Advertise Here Enjoyed your answer? So there you go, next step in troubleshooting….install/confirm that you have installed Service Pack 3 (SP3).

Why were hatched polygons pours used instead of solid pours in the past? weblink cpio read error: Unknown error: 0") {\n NSFilePath = "/var/folders/zz/zzzivhrRnAmviuee+++++++++/-Tmp-/PKInstallSandbox-tmp/Root";\n NSLocalizedDescription = "An error occurred while extracting files from the package \U201cSurroundImpulseResponses.pkg\U201d.";\n NSURL = "../Packages/SurroundImpulseResponses.pkg -- file://localhost/Volumes/Final%20Cut%20Studio%20Install/Installer/FinalCutStudio .mpkg/";\n NSUnderlyingError = "Error If you make a disc image of all the discs, during installation it will go from from one disc image to the next, not asking to insect discs. And report if below 25% free. - Oracle instances discovery.

How could banks with multiple branches work in a world without quick communication? Try JIRA - bug tracking software for your team. Engine Preheating says May 19, 2010 at 1:36 pm We loved your writing style, please keep it up! navigate here Script line: 17312.

Hope you enjoy this MP. and trying to install from the images that way. Because the procedu… MS Server OS Servers Sharing Services Article by: Lee Know what services you can and cannot, should and should not combine on your server.

I cleaned off my fingerprint and it install correctly.

Only one (non-cascaded) Ant target is called from Hudson:

you'll need your outer ant call to cascade the failure and also return an error so Hudson can recognize the failure. tfs2012 share|improve this question asked Jan 8 '14 at 7:15 Kre Toni 1241313 add a comment| 2 Answers 2 active oldest votes up vote 1 down vote I got the solution. That’s all. his comment is here Doing a full update might just resolve this issue as well.

Contact the software manufacturer for assistance.'. These servers do not show up in the Discovered Inventoryfor SQL DB Engine, so I guess I'm in the clear here.Cheers,SergePost by Anders Bengtsson [MVP]Hi Serge,I have seen something about this I already posted about this here somewhere.I assume that as long that Discovery doesn't run, nothing else from the SQLMP will kick in ... You may have a defective disc.'The Installer encountered an error that caused the installation to fail.

Please help, what can i do? Looking for a quick fix and getting all frisky about it won't help. People Assignee: Unassigned Reporter: johanwannheden Votes: 0 Vote for this issue Watchers: 0 Start watching this issue Dates Created: 2010/Jul/14 1:51 AM Updated: 2011/Feb/10 7:08 PM Resolved: 2010/Jul/14 8:08 AM Atlassian And the option of pressing Yes or No, no matter which one you press the User Accounts dialog opens anyway.

If I let a friend drive my car for a day should I tell my insurance company? Remove the install disc and check the condition of the disc. I have checked my settings as told, with no help, ran a reg cure with no help. The OS is Windows Server 2003 Enterprise SP1 almost 99% have to double check when I get back into the office. 0 LVL 51 Overall: Level 51 Windows Server 2003

The "experts" as you put it can't find the solution to this problem as A) you're computer has CRAP LOADS of scripts running in the background that users aren't aware of Does the existence of Prawn weapons suggest other hostile races in the District 9 universe? Would the one ring work if it was worn on the toe instead of the finger? Basically my system is running SCOM 2007 R2 SP1 CU4 Alert: Backward Compatibility Script Error Source:Myserver.MyDomain.local Path:Myserver.MyDomain.local Last modified by: System Last modified time: 30-03-2011 12:13:03 Alert description: An error

Workflow name:System.Mom.BackwardCompatibility.ServiceStateMonitoring Instance name:Server.FQDN Instance ID: {0548D995-9F32-7123-9892-21C13A947ABF} Managementgroup: MGTGroupAny ideas?Cheers,Serge Anders Bengtsson [MVP] 2008-03-23 11:07:55 UTC PermalinkRaw Message Hi Serge,Please make sure you have the latest version of the Datawarehouse managementpack Covered by US Patent. From the log, this endpoint is not accessible. Not the answer you're looking for?

ANybody know why this happens, and how I can upload a fix or something???? If all else fails….just do what I did (as I'm NOT a windoze fan) and use Mozilla Firefox as your default web browser. Helpful (0) Reply options Link to this post by Tom Wolsky, Tom Wolsky Dec 6, 2009 3:44 AM in response to reymasumoto Level 10 (118,282 points) Apple TV Dec 6, 2009