Home > Error In > Antclassloader Java.util.zip.zipexception Error In Opening Zip File

Antclassloader Java.util.zip.zipexception Error In Opening Zip File

Contents

from ${ftp.remote.dir}/${branch.name}${buildfolder}/external/${OsName}${is64bit}" /> userid="${ftp.user.name}" remotedir="${ftp.remote.dir}/${branch.name}${buildfolder}/external/${OsName}${is64bit}" password="${ftp.user.password}" passive="true"> check my blog

Terms Privacy Security Status Help You can't perform that action at this time. Sign in to comment Contact GitHub API Training Shop Blog About © 2016 GitHub, Inc. twlkyao commented Dec 15, 2013 I have tried both solutions without success, it once said success, but without generating the plugin, I have tried several times still without success, it reports Simple string joiner in modern C++ more hot questions question feed default about us tour help blog chat data legal privacy policy work here advertising info mobile contact us feedback Technology http://stackoverflow.com/questions/17248991/java-uti-zip-zipexception-error-while-calling-a-ant-target

Ant Build Error In Opening Zip File

You signed out in another tab or window. avoiding ZipException up vote 17 down vote favorite 4 I'm trying to run my junit tests using ant. website: http://archive.apache.org/dist/ant/ivy/2.1.0/ And then extract the ivy-2.1.0.jar from the tar of apache-ivy-2.1.0-bin.tar.gz . I understand that I can withdraw my consent at any time.

share|improve this answer answered Jan 20 '09 at 14:23 guerda 9,9732072125 add a comment| up vote 0 down vote Thanks guys for this information. My home country claims I am a dual national of another country, the country in question does not. BUILD FAILED /home/github/hadoop2x-eclipse-plugin/src/contrib/build-contrib.xml:476: You need Apache Ivy 2.0 or later from http://ant.apache.org/ It could not be loaded from http://repo2.maven.org/maven2/org/apache/ivy/ivy/2.1.0/ivy-2.1.0.jar Total time: 1 second kangfoo commented Dec 15, 2013 Delete the /home/github/hadoop2x-eclipse-plugin/ivy/ivy-2.1.0.jar While running ant script for building and running a simple hibernate program i m getting following exception.

Post Reply Bookmark Topic Watch Topic New Topic programming forums Java Java JSRs Mobile Certification Databases Caching Books Engineering Languages Frameworks Products This Site Careers Other all forums Forum: Object Relational Thanks ! Bu If I perform compile operation through ANT then ANT target call is failing with the above error. https://github.com/winghc/hadoop2x-eclipse-plugin/issues/4 Previous PostInjecting UUIDGenFactory with Spring (static factory methods) Next PostTutorial: Logging with AOP using AspectJ and Spring 3 1 Comment on "Exception adding individually files to classpath [taskdef] java.util.zip.ZipException: error in

In case of problems with the functioning of ASF Bugzilla, please contact [email protected] Join them; it only takes a minute: Sign up Configuring ant to run unit tests. You should be able to safely ignore this message. How to see detailed information about a given PID?

Ant Junit Java.util.zip.zipexception Error In Opening Zip File

Train carriages in the Czech Republic Modern solders carry axe instead of combat knife. Do I need to cite an old theorem, if I've strengthened it, wrote my own theorem statement, with a different proof? Ant Build Error In Opening Zip File I had included my classes directory in my path using a fileset as opposed to a pathelement this was causing .class files to be opened as ZipFiles which of course threw Java.util.zip.zipexception Error In Opening Zip File Eclipse Will the medium be able to last 100 years?

Browse other questions tagged java ant or ask your own question. click site If there are other files that you do not need/want including in the directory then put together a fileset and exclude those not required. We recommend upgrading to the latest Safari, Google Chrome, or Firefox. My AccountSearchMapsYouTubePlayNewsGmailDriveCalendarGoogle+TranslatePhotosMoreShoppingWalletFinanceDocsBooksBloggerContactsHangoutsEven more from GoogleSign inHidden fieldsSearch for groups or messages Dashboards Projects Issues Agile Help Online Help GreenHopper Help Agile Answers Keyboard Shortcuts About JIRA JIRA Credits What’s New Log

People Assignee: Unassigned Reporter: Charitha Kankanamge Votes: 0 Vote for this issue Watchers: 0 Start watching this issue Dates Created: 13/Jul/12 6:42 AM Updated: 14/Aug/12 2:10 AM Resolved: 19/Jul/12 6:03 AM Please Note: this e-mail address is only for reporting problems with ASF Bugzilla. Please don't fill out this field. news Modify the code like this: Copy the ivy-2.1.0.jar jar to the path of hadoop2.x ${hadoop2.x.root}/share/hadoop/common/ Run the script again.

And I also used to get the following message at the end of the logging:Code: Select all[hibernatetool] DEBUG [main] (SchemaExport.java:252) - import file not found: /import.sqlAt this point I was not Reload to refresh your session. How to deal with a very weak student?

Howto prevent chrgrp from clearing “setuid bit”?

Can filling up a 75 gallon water heater tank without opening a faucet cause damage? asked 7 years ago viewed 16325 times active 3 years ago Linked 6 ZipException while converting to dex with Ant, in eclipse it works ok Related 66JUnit: how to avoid “no Rgds Mahesh PS Post Reply Bookmark Topic Watch Topic New Topic Similar Threads Odd exception with Axis 1.4 and ant taskdef Not able to understant object initialisation WAS 6.1 not Join them; it only takes a minute: Sign up java.uti.zip.ZipException error while calling a ant target up vote 2 down vote favorite 1 While calling a ANT target, I am getting

So the class path should contain only explicit references to JAR [files] and/or the names of the [directories] where other resources like class files are to be found. Problem? This helped when I was having the same errors Leave a Reply Cancel reply Your email address will not be published. http://svbuckeye.com/error-in/ant-junit-java-util-zip-zipexception-error-in-opening-zip-file.php Update - Fixed Found my problem.

Unable to obtain resource from /home/matti/.ivy2/cache/org.jboss.ejb3.depchain/jboss-ejb3-depchain-as6/poms/jboss-ejb3-depchain-as6-1.0.4.pom: java.util.zip.ZipException: error in opening zip file [junit] Unable to obtain resource from /home/matti/.ivy2/cache/org.jboss.ejb3.depchain/jboss-ejb3-depchain-as6/poms/jboss-ejb3-depchain-as6-1.0.4.pom: [junit] java.util.zip.ZipException: error in opening zip file [junit] at java.util.zip.ZipFile.open(Native Method) [junit] Browse other questions tagged java ant junit or ask your own question. Check following error source: classpath: print out the classpath variable in a junit test, run it from eclipse and ant, so you can compare them Check your project for absolute paths. If you add a individually file to the classpath you get an exception which looks like this; [junit] java.util.zip.ZipException: error in opening zip file [junit] at java.util.zip.ZipFile.open(Native Method) [junit] at java.util.zip.ZipFile.(Unknown

more stack exchange communities company blog Stack Exchange Inbox Reputation and Badges sign up log in tour help Tour Start here for a quick overview of the site Help Center Detailed avoiding ZipException3How can I provide a custom log4j.xml for different ant tasks?325Why use Gradle instead of Ant or Maven?26Ant + JUnit: NoClassDefFoundError5Is it possible to exclude some targets from Ant targets All Rights Reserved. Jeff FischerBroadleaf [email protected] Top skip Beginner Posts: 16 Joined: Wed May 16, 2012 2:51 pm Re: [hibernatetool] java.util.zip.ZipException: error in opening Quote Postby skip » Sat May 26, 2012 11:14 pm

class: java.util.zip.ZipException: error in opening zip file [java] Unable to obtain resource from C:\products\apimanager\wso2bam-2.0.0-SNAPSHOT\lib\tomcat\ work\Catalina\localhost\datareceiver\WEB-INF\classes\org\wso2\carbon\databridge\receiver\restapi\Str eamsService.class: [java] java.util.zip.ZipException: error in opening zip file Activity All Comments Work Log History Activity Hide Sign up for the SourceForge newsletter: I agree to receive quotes, newsletters and other information from sourceforge.net and its partners regarding IT services and products. Password Validation in Python How does ArcGIS modify a TIF file while georeferencing? How could banks with multiple branches work in a world without quick communication?

Buil.xml File content

How could banks with multiple branches work in a world without quick communication? testcase classname="test.CordysCapsInstallerTest" name="initializationError0" time="0.007"> java.lang.NullPointerException at java.util.TreeMap.compare(TreeMap.java:1188) at java.util.TreeMap.put(TreeMap.java:531) at com.cordys.cm.uiunit.junit4.internal.runners.UIUnitClassMethodsRunner.getTestMethods(UIUnitClassMethodsRunner.java:168) at com.cordys.cm.uiunit.junit4.internal.runners.UIUnitClassMethodsRunner.(UIUnitClassMethodsRunner.java:45) at com.cordys.cm.uiunit.junit4.runners.UIUnitRunner.(UIUnitRunner.java:15) at java.lang.reflect.Constructor.newInstance(Constructor.java:525) at java.lang.reflect.Constructor.newInstance(Constructor.java:525) java ant share|improve this question edited Jun 22 '13 at Please refer to our Privacy Policy or Contact Us for more details You seem to have CSS turned off. Discussion Romain PELISSE - 2011-12-07 Can you test with the lastest release (4.3) and confirm your bug is still there ?

asked 3 years ago viewed 4820 times active 3 years ago Linked 0 How to use ant JUnit task with Related 17Configuring ant to run unit tests.