Home > Error In > Ant Zipexception Error In Opening Zip File

Ant Zipexception Error In Opening Zip File

Contents

Bu If I perform compile operation through ANT then ANT target call is failing with the above error. Train carriages in the Czech Republic Can Customs make me go back to return my electronic equipment or is it a scam? Is this safe to display MySQL query error in webpage if something went wrong? share|improve this answer answered Jan 20 '09 at 14:23 guerda 9,9732072125 add a comment| up vote 0 down vote Thanks guys for this information. check my blog

If you add a individually file to the classpath you get an exception which looks like this; [junit] java.util.zip.ZipException: error in opening zip file [junit] at java.util.zip.ZipFile.open(Native Method) [junit] at java.util.zip.ZipFile.(Unknown Reload to refresh your session. They overflow my logs and make the developers think that there is something wrong, Thank you. If you do have a , or something similar anywhere in your build file, make sure to any and all binary files. here

Java Util Zip Zipexception Error In Opening Zip File

BTW, you should have post your build file, bug would have been easier to track. avoiding ZipException up vote 17 down vote favorite 4 I'm trying to run my junit tests using ant. How do I align the view to the local axis of an object? Join them; it only takes a minute: Sign up Configuring ant to run unit tests.

Rosa Parks is a [symbol?] for the civil rights movement? Update - Fixed Found my problem. All Rights Reserved. Ant Build Error In Opening Zip File Linked 2 How to get JOGL on Ubuntu 11.10 to work Related 0eclipse several ant build file25Getting Error running javac.exe compiler message, while using Ant in Eclipse2ant : jar and zipfileset

I had included my classes directory in my path using a fileset as opposed to a pathelement this was causing .class files to be opened as ZipFiles which of course threw Caused By Java Util Zip Zipexception Error In Opening Zip File Which plural to use if more than one exists? Not the answer you're looking for? http://stackoverflow.com/questions/2601364/ant-build-classpath-jar-generates-error-in-opening-zip-file Is this safe to display MySQL query error in webpage if something went wrong?

Can an opponent folding make you go from probable winner to probable loser? Ant Junit Java.util.zip.zipexception Error In Opening Zip File In your case it should be: package testmanagment; import junit.framework.*; public class EasyTest extends TestCase { public EasyTest() { super("Easy Test"); } public void setUp() { } public void testSeeMee() throws You may want to try creating a TestCase class that isn't abstract class. Thanks !

Caused By Java Util Zip Zipexception Error In Opening Zip File

more stack exchange communities company blog Stack Exchange Inbox Reputation and Badges sign up log in tour help Tour Start here for a quick overview of the site Help Center Detailed you can try this out Mahesh Panchananam Greenhorn Posts: 18 posted 5 years ago Envt issue, delete all the pre-built jars & classes folders then run ant task. Java Util Zip Zipexception Error In Opening Zip File Class files aren't JAR archives, so the classloader throws an error when it tries to load classes from it. Java Util Zip Zipexception Error In Opening Zip File War Browse other questions tagged java ant junit or ask your own question.

testcase classname="test.CordysCapsInstallerTest" name="initializationError0" time="0.007"> java.lang.NullPointerException at java.util.TreeMap.compare(TreeMap.java:1188) at java.util.TreeMap.put(TreeMap.java:531) at com.cordys.cm.uiunit.junit4.internal.runners.UIUnitClassMethodsRunner.getTestMethods(UIUnitClassMethodsRunner.java:168) at com.cordys.cm.uiunit.junit4.internal.runners.UIUnitClassMethodsRunner.(UIUnitClassMethodsRunner.java:45) at com.cordys.cm.uiunit.junit4.runners.UIUnitRunner.(UIUnitRunner.java:15) at java.lang.reflect.Constructor.newInstance(Constructor.java:525) at java.lang.reflect.Constructor.newInstance(Constructor.java:525) java ant share|improve this question edited Jun 22 '13 at click site Does Barack Obama have an active quora profile? This has only started happening recently although I can't remember with which Gradle version it started. Which requires more energy: walking 1 km or cycling 1 km at the same speed? Java Util Zip Zipexception Error In Opening Zip File Tomcat

I understand that I can withdraw my consent at any time. What is this syntax inside a GNU C statement expression extension? BUILD FAILED /home/github/hadoop2x-eclipse-plugin/src/contrib/build-contrib.xml:476: You need Apache Ivy 2.0 or later from http://ant.apache.org/ It could not be loaded from http://repo2.maven.org/maven2/org/apache/ivy/ivy/2.1.0/ivy-2.1.0.jar Total time: 1 second kangfoo commented Dec 15, 2013 Delete the /home/github/hadoop2x-eclipse-plugin/ivy/ivy-2.1.0.jar http://svbuckeye.com/error-in/antclassloader-java-util-zip-zipexception-error-in-opening-zip-file.php here's a little piece of what ant spat out when i ran it with the -debug option. [junit] Using CLASSPATH /host/Users/Sheena/Desktop/School/Software dev/lab_project/lib/junit-4.8.1.jar:/host/Users/Sheena/Desktop/School/Software dev/lab_project/lib/sqlitejdbc-v056.jar:/host/Users/Sheena/Desktop/School/Software dev/lab_project/build/classes:/host/Users/Sheena/Desktop/School/Software dev/lab_project/build/test/testmanagment/EasyTest.class:/host/Users/Sheena/Desktop/School/Software dev/lab_project/build/test/testmanagment/TestTest.class:/host/Users/Sheena/Desktop/School/Software dev/lab_project/build/test/testmanagment/TestUser.class:/usr/share/ant/lib/junit.jar:/usr/share/java/ant-launcher-1.7.1.jar:/usr/share/ant/lib/ant.jar:/usr/share/ant/lib/ant-junit.jar Class org.apache.tools.ant.taskdefs.optional.junit.BriefJUnitResultFormatter loaded from

If you would like to refer to this comment somewhere else in this project, copy and paste the following link: Andreas Dangel - 2013-03-17 status: pending --> more-info-needed assigned_to: Tom Copeland Error In Opening Zip File Java Must have screwed up a download or something at some point. website: http://archive.apache.org/dist/ant/ivy/2.1.0/ And then extract the ivy-2.1.0.jar from the tar of apache-ivy-2.1.0-bin.tar.gz .

Translate in-line equations to TeX code (Any Package?) What is the difference between touch file and > file?

Home Categories FAQ/Guidelines Terms of Service Privacy Policy Powered by Discourse, best viewed with JavaScript enabled Log In Java.util.zip.ZipException: error in opening zip file Old Forum Alex_Sko (Alex Sko) 2013-05-15 05:50:00 Usage of "it" to start a sentence more hot questions question feed default about us tour help blog chat data legal privacy policy work here advertising info mobile contact us feedback Where should libraries be? Java.util.zip.zipexception Error In Opening Zip File Eclipse In it, you'll get: The week's top questions and answers Important community announcements Questions that need answers see an example newsletter By subscribing, you agree to the privacy policy and terms

How can I remove perfectly round locking wheel lugs? This doesn't work. Already have an account? More about the author Cheers" share|improve this answer answered Sep 1 '11 at 13:59 Alastair Brayne 4461620 I had loads of hidden jars (.!79974!google-play-services.jar) causing the issue, thanks for the idea! –rob5408 Feb

Alex_Sko (Alex Sko) 2013-10-30 00:04:00 UTC #5 same problem with Gradle 1.7 and Gradle 1.8 Peter_Niederwieser (Peter Niederwieser) 2013-10-30 13:18:00 UTC #6 It's a bug in your build script. It could not be found. I had included my classes directory in my path using a fileset as opposed to a pathelement this was causing .class files to be opened as ZipFiles which of course threw The flash of STM32F10x cannot run at 24MHZ without latency stably?

I help millions of people every day, but am taken for granted by all but one When was this language released? I'm pretty new to both ant and Java so please be patient. The TEK Blog Ant, Development, Java Exception adding individually files to classpath [taskdef] java.util.zip.ZipException: error in opening zip fileMarch 8, 2011 admin 1 Comment If been putting together some ant scripts Required fields are marked * Name * Email * Website Comment You may use these HTML tags and attributes:

well, that made me suspicious of a systemic fault. Why write an entire bash script in functions?