Home > Error In > Ant Javac Error Error Reading Error In Opening Zip File

Ant Javac Error Error Reading Error In Opening Zip File

Contents

How could banks with multiple branches work in a world without quick communication? I was able to get a successful build eventually. Once executed, it quickly displays the following error: Description Resource Path Location Type Cannot read lifecycle mapping metadata for artifact org.apache.maven.plugins:maven-install-plugin:maven-plugin:2.3.1:runtime Cause: error in opening zip file pom.xml /maven line 1 I stop tomcat, call ant, restart tomcat. http://svbuckeye.com/error-in/ant-javac-error-in-opening-zip-file.php

Rename the file to .txt before attaching it. Any help would be appreciated! Platform Version: 2.1-update1 API level: 7 Resolving library dependencies: Ordered libraries: Importing rules file: tools/ant/ant_rules_r3.xml BUILD FAILED /home/juego/android-sdk-linux_x86/tools/ant/ant_rules_r3.xml:336: Compile failed; see the compiler error output for details. Chris Jenkins (1465) OliverRodriguez (7) Mar 19, 2015 at 11:29 AM 0 I'm not sure.

Error In Opening Zip File Java

I will try to unzip the mapss.jar file on the remote server in which I'm working on. Sorry for inconvenience caused.Let us know if you have any questions. I am not sure.

I've also tried from the commandline and as sudo - again, same results. Is that incorrect? 2. Can you open it in a WinZip or other compression tool? –VonC Apr 8 '10 at 16:14 Sigh. Java Compile Error In Opening Zip File Did you use the same one and just re-add it or did you find another?

Can you help me then with the other problem I get when I try to use the embedded version of Maven, or even if I download version 3.0.5 separately? Error In Opening Zip File Gradle Here is my fork of your project: RetailServletSoloTest You could try getting it from that. That's not right, is it? https://sourceforge.net/p/thinwire/discussion/604608/thread/22934848/ I am working on a project on a UNIX server.

Running an empty sketch (or any simple one) in android mode. Maven Clean Plugin 2.4 1 Jar Error In Opening Zip File asked 6 years ago viewed 13712 times active 4 years ago Visit Chat Linked 2 How to get JOGL on Ubuntu 11.10 to work Related 0eclipse several ant build file25Getting Error How did you add the jar initially? Bug33583 - javac task ZipException - linux - java 1.5 Summary: javac task ZipException - linux - java 1.5 Status: RESOLVED INVALID Product: Ant Classification: Unclassified Component: Core tasks Version: 1.6.2

Error In Opening Zip File Gradle

Post Reply Bookmark Topic Watch Topic New Topic Similar Threads java.io.IOException: Corrupt GZIP trailer decodeStream() OR Put large file in ASSETS folder How to unzip password protected zip file in java? https://www.genuitec.com/forums/topic/all-maven-projects-start-with-failure-cannot-open-zip-file/ Platform Version: 2.1-update1 API level: 7 Resolving library dependencies: Ordered libraries: Importing rules file: tools/ant/ant_rules_r3.xml Creating full resource package... Error In Opening Zip File Java Please refer to our Privacy Policy or Contact Us for more details You seem to have CSS turned off. Error In Opening Zip File Jenkins Turns out I did in fact have aload of garbage jars on the classpath.

I am merely testing it. http://svbuckeye.com/error-in/ant-compile-error-in-opening-zip-file.php Anayonkar Shivalkar Bartender Posts: 1557 5 I like... Middleware Fusion Middleware 11g(incl. I soon learned that this was not the source of the problem as I received the same error messages from above. Error In Opening Zip File Maven

Buildfile: build.xml init: compile: [javac] Compiling 1 source file to ../WEB-INF/classes [javac] ../db/map/Event.java [javac] error: error reading ../actions/EventAction.class; java.util.zip.ZipException: error in opening zip file [javac] 1 error BUILD FAILED Comment 1 if so, you might need to delete any processing-core-XXXX.jar from your sketchbook folder so that it re-downloads. To make a long story short, the text replacement worked flawlessly, however any binary file, executable or .jar that was in that "**/*" path was totally destroyed. More about the author Presumably, the error in make is a result of the error in unzipping the .jar file, so we can ignore this for now.

This is mere speculation. Error In Opening Zip File Tomcat I have been running into compilation issues ever since I started and I've finally reached one I can't figure out how to fix (or maybe I'm too tired). Any thoughts?

Ordering a list of strings Translate in-line equations to TeX code (Any Package?) What is this syntax inside a GNU C statement expression extension?

I am using separately download Maven 3.1.1 instead of embedded version. Tried with Processing-0190 on the same system with an empty sketch, it seems to work: Android SDK Tools Revision 7 Project Target: Google APIs Vendor: Google Inc. jar xf mapss.jar It works perfectly fine and unzips just as expected! Error In Opening Zip File Weblogic Comment People who like this Close 0 Show 5 Share 10 |3000 characters needed characters left characters exceeded Viewable by all users Viewable by moderators Viewable by moderators

well, that made me suspicious of a systemic fault. March 5, 2014 at 12:51 pm #347780 Reply trantParticipant @support-swapna wrote: Trant, Thank you for the log file. 1. Description Alessandro Scotti 2005-02-15 12:02:07 UTC Apache Ant version 1.6.2 compiled on July 16 2004 Java version: 1.5 I have a javac task that depends on init, if I delete all http://svbuckeye.com/error-in/ant-error-in-opening-zip-file.php Yeah I guess I added the jar wrong.

What a gift. keyword2 keyword1 +keyword2 Questions excluding a word, e.g. Comment 3 Stefan Bodewig 2005-02-18 12:27:43 UTC It looks as if the jar file containing ../actions/EventAction.class was corrupt. Show more comments Your answer Text editing toolbar Hint: You can notify a user about this post by typing @username.

You signed in with another tab or window. processing-bugs commented Feb 10, 2013 From juego.video on October 25, 2010 15:46:33 So did: $:~$ unzip -l /home/juego/sketchbook/android_empty/android/libs/processing-core.jar Archive: /home/juego/sketchbook/android_empty/android/libs/processing-core.jar End-of-central-directory signature not found. Nonetheless, here is my issue: When trying to compile my code, I get hung up on a .jar file which the compiler seems to have trouble unzipping. When I run as Maven Build and set the goal as ‘compile' then Run it outputs Build Success.

EDIT: Also, I cannot look at the code within the mapss package. Comment 4 Alessandro Scotti 2005-02-18 13:06:26 UTC The fileS that raise the error are ALL the class files that ant will not compile because nothing changed. Which requires more energy: walking 1 km or cycling 1 km at the same speed? Must have screwed up a download or something at some point.

Home Categories FAQ/Guidelines Terms of Service Privacy Policy Powered by Discourse, best viewed with JavaScript enabled ASF Bugzilla – Bug33583 javac task ZipException - linux - java 1.5 Last modified: 2008-02-22 What does "jar tf that-jar-file" say?