Home > Error Code > Altiris Error Code 1642

Altiris Error Code 1642

Contents

ERROR_UNKNOWN_FEATURE1606The feature identifier is not registered. version 10.1.1. Verify that the specified log file location exists and that you can write to it. 1623 The language of this installation package is not supported by your system. 1624 Error applying Contact your support personnel. http://svbuckeye.com/error-code/altiris-error-code-1603.php

To configure or remove the existing version of this product, use Add/Remove Programs in Control Panel. The local interface will be disabled until the DHCP client can obtain a new address. 4200 The GUID passed was not recognized as valid by a WMI data provider. 4201 The Security Update for SQL Server 2012 Service Pack 2...Aug 01, 2015 · It is Security Update for SQL Server 2012 Service Pack 2 (KB3045321). ... Disconnect all previous connections to the server or shared resource and try again. 1220 An attempt was made to establish a session to a network server, but there are already too http://www.symantec.com/connect/forums/altiris-exit-codes-1605-and-1642

Msi Exit Codes

ERROR_INSTALL_LOG_FAILURE1622There was an error opening installation log file. It may already have been terminated. 1313 A specified privilege does not exist. 1314 A required privilege is not held by the client. 1315 The name provided is not a properly ERROR_INSTALL_ALREADY_RUNNING 1619 This installation package could not be opened.

Available beginning with Windows Installer version 3.0. Was a full backup done before? 4004 The backup failed. Additional information is available in the log file \\mycomputer\c$\PATCH.txt. Windows Installer Error Codes Contact your application vendor.

Please contact your system administrator. 1270 The smartcard certificate used for authentication has expired. Msi Error Code 1603 If Windows Installer determines a product may be incompatible with the current operating system, it displays a dialog informing the user and asking whether to try to install anyway. For more information, open Event Viewer or contact your system administrator. 1261 A program attempt to use an invalid register value. anchor Contact your support personnel. 1622 Error opening installation log file.

The structure of one of the files containing registry data is corrupted, or the system's memory image of the file is corrupted, or the file could not be recovered because the Bigfix Exit Codes Contact your system administrator. This error code is returned if the user chooses not to try the installation. The function returns the value ERROR_CALL_NOT_IMPLEMENTED.

Msi Error Code 1603

ERROR_INSTALL_PACKAGE_REJECTED 1626 Function could not be executed. https://msdn.microsoft.com/en-us/library/windows/desktop/aa376931(v=vs.85).aspx Verify that the specified transform paths are valid. Msi Exit Codes Join a real-time chat and ask the experts. Msi Motherboard Error Codes If you feel you are in need of support for a Microsoft product, please go to our technical support site at support.microsoft.com.   Error codeValueDescription ERROR_SUCCESS0The action completed successfully.

Error code 1642. Check This Out Installation of this version cannot continue. Please contact your system administrator. ERROR_PATCH_TARGET_NOT_FOUND 1643 The patch package is not permitted by system policy. Altiris Error Codes

ERROR_SUCCESS_REBOOT_INITIATED1641The installer has initiated a restart. The following script will help in getting the Exit/Error code of Application installation else on can get it from log file. This message is indicative of a success. Source logo-symantec-dark-source Loading Your Community Experience Symantec Connect You will need to enable Javascript in your browser to access this site. © 2016 Symantec Connect Endpoint Management > Articles Entire Site Search

Verify that the package exists and that you can access it, or contact the application vendor to verify that this is a valid Windows Installer package. 1620 This installation package could Windows Installer Exit Codes Windows System Error Codes (exit codes) Description Created: 28 Jan 2009 • Updated: 20 Dec 2010 | 9 comments Language TranslationsMachine TranslationsDeutsch Français Español 简体中文 日本語 Sidd +19 19 Votes Login The system will be restarted so the changes can take effect. 1642 The upgrade patch cannot be installed by the Windows Installer service because the program to be upgraded may be

To configure or remove the existing version of this product, use Add/Remove Programs on the Control Panel.

ERROR_PATCH_TARGET_NOT_FOUND 1642 (0x66A) error code 1642 failed remote agent install - VOXerror code 1642 failed remote agent install; VOX: Backup and Recovery: Backup Exec: error code 1642 failed remote agent install; ERROR_SUCCESS 13 Data is Invalid. No slot is available for use. 4323 The transport cannot access the medium. 4324 Unable to load the medium into the drive. 4325 Unable to retrieve status about the drive. 4326 Bigfix Exit Code 1 Verify that the patch package exists and is accessible, or contact the application vendor to verify that this is a valid Windows Installer patch package.

ERROR_INSTALL_TRANSFORM_FAILURE 1625 This installation is forbidden by system policy. Verify that the program to be upgraded exists on your computer and that you have the correct upgrade patch. Error 1642 Installing KB2494089 fails with Error code 1642 Fix Autodesk Error Code 1642 - Windows XP, Vista,...Autodesk Error Code 1642. have a peek here Created and staffed by volunteer Altiris admins, the IRC #Altiris chat room is your place for solutions.

close × Similar Questions Error Code 1642 Adobe? Possible reasons are blank passwords not allowed, logon hour restrictions, or a policy restriction has been enforced. 1328 Logon failure: account logon time restriction violation. 1329 Logon failure: user not allowed Use your global user account or local user account to access this server. 1810 The name or security ID (SID) of the domain specified is inconsistent with the trust information for ERROR_UNKNOWN_FEATURE 1607 Component ID not registered.

Login or Register to post your comment. ERROR_CALL_NOT_IMPLEMENTED120This value is returned when a custom action attempts to call a function that cannot be called from custom actions. To configure or remove the existing version of this product, use Add/Remove Programs on the Control Panel. 1639 Invalid command line argument. ERROR_INSTALL_TRANSFORM_REJECTED 3010 A reboot is required to complete the install.

Available beginning with Windows Installer version 3.0. More discussions in Acrobat Reader All CommunitiesAcrobat Reader 3 Replies Latest reply on Sep 28, 2011 7:16 AM by AbhigyanModi Windows installer error 1642 when loading patch for Reader 10 bi88283 Created: 22 Jan 2009 • Updated: 22 Jan 2009 | 2 comments Language TranslationsMachine TranslationsDeutsch Français Español 简体中文 日本語 MaggieH +3 3 Votes Login to vote Tweet This is a summary Free up space on the drive or verify that you have write permission on the Temp folder. 1633 This installation package is not supported by this processor type.

This error code is returned if the user chooses not to try the installation. ERROR_INSTALL_TRANSFORM_FAILURE1624There was an error applying transforms. Contact the application vendor to verify that this is a valid Windows Installer package. ERROR_SUCCESS_REBOOT_INITIATED: 1642: - read more Tweet Please vote if the answer you were given helped you or not, thats the best way to improve our algorithm.

Our software and services protect against more risks at more points, more ... Normally caused by an uninitialized register. Available beginning with Windows Installer version 3.0. Error Code 1642 while applying...Error Code 1642 while applying SQLServer2008R2-KB3045314-x64.exe.

MsiExec.exe and InstMsi.exe Error Messages These error codes are returned by the Windows Installer functions MsiExec.exe and InstMsi.exe. ERROR_PATCH_PACKAGE_UNSUPPORTED 1638 Another version of this product is already installed.