Home > App Error > App Error 104 Uncaught Classcastexception

App Error 104 Uncaught Classcastexception

keep in touch.. –Jamaley Jan 27 '11 at 4:46 he problem is solved..thanks everyone support me.. –Jamaley Jan 27 '11 at 4:50 add a comment| Your Answer draft But now even after commenting out this section of the code the error does not go away.....i tried clean.bat but still no luck.... Home What's New? Right now, not all of the individual tests are skipped when the OS is not Linux. navigate to this website

Major bug reported by Nishkam Ravi and fixed by Nishkam Ravi (conf) Bug in Configuration.java exposed by Spark (ConcurrentModificationException) HADOOP-10455. Major bug reported by Jian He and fixed by Vinod Kumar Vavilapalli Few tests in TestJobClient fail on Windows MAPREDUCE-5830. Mark this post as solution if it solved your problem. Sorry for getting back so late....i agree that the problem first occurred when i tried to typecast an instance of java.util.Enumeration to BBPlatformContact type.

Here is the announcement. Changes since Hadoop 2.4.0 YARN-2081. PM41429 Saving passwords in Mozilla Firefox causes console fields to be prefilled PM45072 WebSphere variables are not created on save after clicking apply if the variables.xml file does not exist for

Dave Doonger Greenhorn Posts: 8 posted 5 years ago Restarted Eclipse and got the logcat to work: 12-16 18:02:30.079: DEBUG/AndroidRuntime(242): >>>>>>>>>>>>>> AndroidRuntime START <<<<<<<<<<<<<< 12-16 18:02:30.079: DEBUG/AndroidRuntime(242): CheckJNI is ON 12-16 PM52654 Plug-in should return 400 on incomplete requests received. PM49844 Server_log_root variable in the updated cluster server template not honoring the user defined value. Thread at a glance: Previous Message by Date: [rhomobile] Re: changelog of 2.4 version What do you mean saying launching?

org.springframework.web.util.NestedServletException: Request processing failed; nested exception is org.springframework.web.socket.sockjs.SockJsException: Uncaught failure in SockJS request, uri=http://127.0.0.1:8080/websocket/tracker/151/ciagbe0w/websocket?access_token=a1d650a3-a4bb-4cc7-8636-82a9dc227364; nested exception is org.springframework.web.socket.sockjs.SockJsTransportFailureException: WebSocket handshake failure; nested exception is java.lang.ClassCastException: org.eclipse.jetty.websocket.jsr356.server.ServerContainer cannot be cast to org.apache.tomcat.websocket.server.WsServerContainer PM43897 NullPointerException thrown in FilteredExtensionPointProxy.getExtension() when trace is enabled PM44240 Application Server crash in wasservice when stopping server PM45089 Collector output should capture NIFHistory.xml, NIFStack.xml and update.status.xml High Availability (HA) PM38774 The root cause is that the test checks for execute permission for all users on every ancestor of the target directory. https://groups.google.com/d/topic/phonegap/pc5UdoXMSW8 PM23201 The console code does not allow the generic server cluster member weight value to be set to zero PM23596 Environment variables with a cluster scope will not affect server PM24306

The customized command line for me is : "C:\Program Files\Research In Motion\BlackBerry Smartphone Simulators 6.0.0\6.0.0.313 (9800)\fledge.exe" /app=Jvm.dll /handheld=9800 /session=Sim1 /app-param=JvmAlxConfigFile:9800.xml /data-port=0x4d44 /data-port=0x4d4e /pin=0x2100000A /app-param=regVersion=3 /app-param=regDestIP=127.0.0.1 /app-param=regDestPort=19781 /app-param=regSrcPort=19780 /app-param=DisableSyncServiceRecord´╗┐ Yours Dave Doonger Greenhorn Posts: 8 posted 5 years ago Thanks Hardik, I should have posted it but I have already made those changes. It would be good to have just one key to enable basic functionality. Need some help here......

  • Why is this compiled function 50x slower?
  • PM31401 Unable to return groupMembership control for a user on 2nd call when caches are enabled.
  • Critical bug reported by Ming Ma and fixed by Ming Ma Killing Task might cause the job to go to ERROR state MAPREDUCE-5833.
  • PM39908 The addGlobalListener API is not available with V6.1 Feature Packs PM44112 ServletOutputStream print method gets into infinite loop if the response buffer is set to a zero value System Management/Repository
  • Problem?
  • share|improve this answer answered Jan 25 '11 at 4:50 phoraceus 1112 do you know how to solved that problem?
  • Major bug reported by Varun Vasudev and fixed by Varun Vasudev TestHistoryServerFileSystemStateStoreService.testTokenStore fails in windows MAPREDUCE-5824.
  • PM22860 http://xforce.iss.net/xforce/xfdb/67110 PM24073 IHS collocated with the deployment manager does not support plugin propagation via IHS admin service or node agent PM26466 IIS plug-in causes heap corruption and crash when armEnabled="true"
  • Next Message by Thread: [rhomobile] Re: WebView.navigate on Blackberry it is BlackBerry JDE 6.0 and BlackBerry 9800 simulator.
  • PM29586 CSCP0007E ActivityPendingException PM30207 Activity service throws ActivityPendingException after receiving SAXParseException while processing a web service response.

Contact Us Use the form below to contact us! To post to this group, send email to [email protected] To unsubscribe from this group, send email to [email protected] For more options, visit this group at http://groups.google.com/group/rhomobile?hl=en. -- You received this message PM31757 WSWS0020 / WSWS0052 may occur during JAX-RPC client deployment PM32695 SOAP header added by JAX-RPC handler is not sent with attachment PM34290 ElementFormDefault AttributeFormDefault attributes are not set in the Modern soldiers carry axes instead of combat knives.

Trivial bug reported by Todd Lipcon and fixed by Chen He docs for map output compression incorrectly reference SequenceFile HDFS-6527. Major bug reported by Varun Vasudev and fixed by Varun Vasudev Test TestFSDownload.testDownloadPublicWithStatCache fails on Windows The TestFSDownload.testDownloadPublicWithStatCache test in hadoop-yarn-common consistently fails on Windows environments. Minor bug reported by Kihwal Lee and fixed by Kihwal Lee Wrong error message for upgrade HDFS-6209. Content size: 810 I 04/26/2011 03:36:34:305 d659800 RhoConnection| dispatch end I 04/26/2011 03:36:35:777 d659800 NetworkAccess| Connect to url: http://www.google.com;deviceside=true I 04/26/2011 03:36:36:168 d659800 NetworkAccess| Connect to url: http://www.google.com.tr/;deviceside=true I 04/26/2011 03:36:36:659

PM33076 VMM throws NoSuchAttributeException while searching PM33488 NullPointerException thrown on trying to update multi valued attributes in Property Extension repository PM34097 Exception message for invalid user name not propogated from VMM However, the test output log has java.lang.AssertionError: Number of applications should only be one! YARN-1281. However, after I click the AskButton it crashes with "App has unexpectedly stopped" error instead of bringing up AskActivity. // HomeActivity package com.example.tabssample; import java.io.IOException; import android.app.Activity; import android.content.Intent; import android.os.Bundle;

GBiz is too! Latest News Stories: Docker 1.0Heartbleed Redux: Another Gaping Wound in Web Encryption UncoveredThe Next Circle of Hell: Unpatchable SystemsGit 2.0.0 ReleasedThe Linux Foundation Announces Core Infrastructure Login with FacebookLogin with Google Register I agree with terms & conditions Register Back to Login Reset Password Reset Password Return to Login Buy Sell Mortgage Your search results Page not PM56267 Invalidating a dependency ID does not invalidate associated cache entries.

General PM37698 Async bean causes work manager to create an enclave that ends up getting hung PM39559 Errors CWSIP0003E, CWSIT0029I & CWSIT0028I appear in the systemout.log when the server hosting messaging

Btw, we didn't run TS because it is not secured yet. HADOOP-10473. JVM reports java/lang/OutOfMemoryError during pthread_create PM32957 java.lang.NoSuchMethodError:com/ibm/icu/math/BigDecimal PM35809 Average CPU time in 120.x records is not computed correctly PM36822 PM09564 fix is incomplete for V6.1 High Availability (HA) PM29179 HAManager bulletin Blocker bug reported by Rohith and fixed by Karthik Kambatla (resourcemanager) Potential NPE in ZKRMStateStore caused by handling Disconnected event from ZK.

PM56183 http://xforce.iss.net/xforce/xfdb/75234 PM58377 Problems using administrative console 12/03/05 ptf pechange PM60251 | symbol cannot used for external provider URLl when configuring a 3rd party JMS provider. Reply With Quote 3rd August 2009,11:30 PM #15 Digitalmayhem View Profile View Forum Posts View Blog Entries View Articles No Products Registered Join Date Feb 2009 Location calgary, alberta, canda Posts Major bug reported by Vinod Kumar Vavilapalli and fixed by Vinod Kumar Vavilapalli TestMapReduceJobControl fails on JDK 7 + Windows MAPREDUCE-5827. Minor bug reported by Robert Joseph Evans and fixed by Mit Desai Docs still refer to 0.20.205 as stable line Skip to content Ignore Learn more Please note that GitHub no

PM24525 Update WebSphere MQ messaging provider to fix pack 6.0.2.10 PM24564 Web Services socket timeout for JAX-RPC/JAX-WS Web Services clients might not be honored. Welcome!