Home > Android Error > Android Error 41

Android Error 41

Contents

hope to see your rom out soon. DroidModderX posted Sep 29, 2016 at 11:24 PM Google Rotation Suggestions... Note: Recompile with -Xlint:deprecation for details. 7 errors make: *** [out/target/common/obj/APPS/CMParts_intermediates/classes-full-debug.jar] Error 41 #1 JBirdVegas, Apr 27, 2011 SithDroid2187 Member Joined: Apr 28, 2011 Messages: 94 Likes Received: 0 Trophy Understanding CTRL-U combination Rosa Parks is a [symbol?] for the civil rights movement? http://svbuckeye.com/android-error/android-error-inflating-class-com-google-android-maps-mapview.php

Sent from my DROID2 using Tapatalk #5 JBirdVegas, May 11, 2011 JBirdVegas Developer Developer Joined: Aug 8, 2010 Messages: 107 Likes Received: 0 Trophy Points: 16 Ratings: +0 But thank Thank you but I still have the same problem. #3 JBirdVegas, May 1, 2011 cush2push Premium Member Premium Member Developer Joined: Jul 21, 2010 Messages: 673 Likes Received: 6 Trophy It is the reason of your issue. Terms & Conditions Android Central Connectedly CrackBerry iMore Windows Central Tesla Central VR Heads MrMobile Flagship faceoff Galaxy Note 7 vs iPhone 7 Plus get started Allo: Everything you need to try here

Android Make Error 41

so can i grab maven from this proj and add it to my recent project? Quick Reply Reply Post Reply Subscribe to Thread vBulletin Message Guest Quick Reply (no urls or BBcode) The following errors occurred with your submission Okay Message: Posting Quick Reply - Can one be "taste blind" to the sweetness of stevia? Should I include him as author?

I lost my jury summons, what can I do? Is my workplace warning for texting my boss's private phone at night justified? Note: Recompile with -Xlint:deprecation for details. Android Error 101 September 29, 2016 Samsung is Waiting to See How the VR Market Develops September 29, 2016 FreedomOS Revisited September 29, 2016 More XDA News Tweet Like +1 Error 41 while building

I am not able to find it in MavenCentral or Jcenter repo. Error 41 Android Build Please fix the errors listed above. ****************************** make: *** [/home/vincenzo/Sorgenti/Liquid/out/target/common/obj/PACKAGING/checkapi-last-timestamp] Errore 38 Edited by Uzumaki99, 02 September 2014 - 12:29 PM. 0 Likes Back to top Back to Development Reply to asked 2 years ago viewed 1921 times Related 11Error from egit installation1What does it take to run an android app on a PC?0SmartGit/Hg launch error2Cannot open Android SDK Manager or Android http://rootzwiki.com/topic/240281-custom-android-rom-make-error-41-and-java-file-error/ Why did companions have such high social standing?

After this, build fails with error 41: out/target/common/obj/JAVA_LIBRARIES/android_stubs_current_intermediates/src/java/util/PropertyPermission.java:2: java.util.PropertyPermission is not abstract and does not override abstract method hashCode() in java.security.Permission public final class PropertyPermission ^ out/target/common/obj/JAVA_LIBRARIES/android_stubs_current_intermediates/src/java/util/logging/LoggingPermission.java:2: java.util.logging.LoggingPermission is not abstract Android Error 403 Unfortunately, it didn't help for me. Is this bad OOP design for a simulation involving interfaces? Redefining cases command more hot questions question feed default about us tour help blog chat data legal privacy policy work here advertising info mobile contact us feedback Technology Life / Arts

Error 41 Android Build

To use Google Groups Discussions, please enable JavaScript in your browser settings, and then refresh this page. . Note: Recompile with -Xlint:deprecation for details. 1 error make: *** [/home/can/android/system/out/target/common/obj/APPS/CMWallpapers_intermediates/classes-full-debug.jar] Error 41 packages/apps/CMFileManager/gen/com/cyanogenmod/filemanager/R.java:6: duplicate class: com.cyanogenmod.filemanager.R public final class R { ^ 1 error make: *** [/home/can/android/system/out/target/common/obj/APPS/CMFileManager_intermediates/classes-full-debug.jar] Error 41 android Android Make Error 41 Jonny Kansas replied Sep 30, 2016 at 7:11 AM I Will Be Going to Jail Today BamaBelle replied Sep 30, 2016 at 7:05 AM New Moto Boot Animatin Incoming! Android Error 941 My girlfriend has mentioned disowning her 14 y/o transgender daughter Why did companions have such high social standing?

petrov.kristiyan.colorpicker:colorpicker-library:1.0.3. http://svbuckeye.com/android-error/android-error-strings-out-xml.php If someone can confirm this to work, I'll accept the answer. –OrhanC1 Sep 12 '13 at 10:20 add a comment| Your Answer draft saved draft discarded Sign up or log DailyProgrammer 284: Wandering Fingers more hot questions question feed default about us tour help blog chat data legal privacy policy work here advertising info mobile contact us feedback Technology Life / Can an opponent folding make you go from probable winner to probable loser? Android Error 921

First thanks, but I tried and was returned invalid username? Why can a Gnome grapple a Goliath? What is the minimum annual overhead required to admin an On-Premises Exchange Server Is this safe to display MySQL query error in webpage if something went wrong? http://svbuckeye.com/android-error/android-error-inflating-class-android-widget-button.php A professor has only proofread my paper.

You are trying to add libraries that doesn't exist. –Gabriele Mariotti Mar 2 at 9:15 ok ...but i downloaded this colorpicker project from github its working good........ Android Error 927 Is it possible to write a C++ function which returns whether the number of arguments is divisible by N? Then I changed some parts of the settings application's source code to integrate some application in the settings munĂ¹.

Join them; it only takes a minute: Sign up Error:(41, 13) Failed to resolve: com.rarepebble:colorpicker:1.6.0 up vote 2 down vote favorite Error:(41, 13) Failed to resolve: com.rarepebble:colorpicker:1.6.0 and Error:(42, 13) Failed

The recent bump to 2.3.4 caused lots of symbol not found errors during the build. Several functions may not work. Why write an entire bash script in functions? Android Error 923 How could banks with multiple branches work in a world without quick communication?

target Java: CMParts (out/target/common/obj/APPS/CMParts_intermediates/classes) packages/apps/CMParts/src/com/cyanogenmod/cmparts/activities/SoundActivity.java:99: cannot find symbol symbol : variable VIBRATE_IN_CALL location: class android.provider.Settings.System Settings.System.VIBRATE_IN_CALL, 1) != 0); ^ packages/apps/CMParts/src/com/cyanogenmod/cmparts/activities/SoundActivity.java:150: cannot find symbol symbol : variable VIBRATE_IN_CALL location: class android.provider.Settings.System he'll sort it very fast. target Java: CMParts (out/target/common/obj/APPS/CMParts_intermediates/classes) packages/apps/CMParts/src/com/cyanogenmod/cmparts/activities/SoundActivity.java:99: cannot find symbol symbol : variable VIBRATE_IN_CALL location: class android.provider.Settings.System Settings.System.VIBRATE_IN_CALL, 1) != 0); ^ packages/apps/CMParts/src/com/cyanogenmod/cmparts/activities/SoundActivity.java:150: cannot find symbol symbol : variable VIBRATE_IN_CALL location: class android.provider.Settings.System check my blog Join them; it only takes a minute: Sign up Android ICS build fails with error 41 up vote 1 down vote favorite I tried to build Android ICS on Ubuntu 10.04

Stay logged in Menu News News Quick Links Recent Activity What's New? Searched in the following locations: https://repo1.maven.org/maven2/com/vstechlab/easyfonts/easyfonts/1.0.0/easyfonts-1.0.0.pom https://repo1.maven.org/maven2/com/vstechlab/easyfonts/easyfonts/1.0.0/easyfonts-1.0.0.jar file:/C:/Users/Altaf/AppData/Local/Android/sdk/extras/android/m2repository/com/vstechlab/easyfonts/easyfonts/1.0.0/easyfonts-1.0.0.pom file:/C:/Users/Altaf/AppData/Local/Android/sdk/extras/android/m2repository/com/vstechlab/easyfonts/easyfonts/1.0.0/easyfonts-1.0.0.jar file:/C:/Users/Altaf/AppData/Local/Android/sdk/extras/google/m2repository/com/vstechlab/easyfonts/easyfonts/1.0.0/easyfonts-1.0.0.pom file:/C:/Users/Altaf/AppData/Local/Android/sdk/extras/google/m2repository/com/vstechlab/easyfonts/easyfonts/1.0.0/easyfonts-1.0.0.jar Required by: com.soundcloud.android:lib:1.0.1 android gradle android-gradle jitpack share|improve this question edited Mar 2 at 10:19 Gabriele Mariotti 54.6k19132158 asked Mar What are the holes on the sides of a computer case frame for? That may be the issue.

What does Sauron need with mithril? Does the existence of Prawn weapons suggest other hostile races in the District 9 universe? more stack exchange communities company blog Stack Exchange Inbox Reputation and Badges sign up log in tour help Tour Start here for a quick overview of the site Help Center Detailed Ask a Question error 41 while building android + Reply Results 1 to 1 of 1 Thread Tools Show Printable Version Search Thread Advanced Search 08-22-2014,02:53 AM Thread Author

I can't confirm this works but it sounds likely to be the solution.