Home > An Error > An Error Has Occurred While Processing The Maven Artifact Tasks

An Error Has Occurred While Processing The Maven Artifact Tasks

Can Customs make me go back to return my electronic equipment or is it a scam? I have been able to install/dependencies custom libraries to a local repo (Artifactory) and have been able to get dependencies (from public repos and local). You signed out in another tab or window. Lewis Ship added a comment - 13/Sep/14 00:02 This is resolved for me as well. Check This Out

My local cache does not have the jar (as I expect with the above error) ant maven-2 share|improve this question asked May 15 '12 at 18:26 Sean 168318 2 Not Show Serban Iordache added a comment - 12/28/12 09:36 PM Thanks, Joel! Return code is: 401 BUILD FAILED I've tried adding wagon-http, wagon-webdav, etc. Hide Permalink Howard M.

Browse other questions tagged maven ant nexus maven-ant-tasks or ask your own question. Hide Permalink John Sichi added a comment - 04/Oct/11 18:52 While attempting to run ant test, I got a PermGen space OOM (in the ivy-resolve after the metastore tests). more stack exchange communities company blog Stack Exchange Inbox Reputation and Badges sign up log in tour help Tour Start here for a quick overview of the site Help Center Detailed

http://www.sonatype.com/people/2010/11/what-to-do-when-nexus-returns-401/ Show Joel Orlina added a comment - 12/28/12 03:43 PM I confess I haven't had much experience troubleshooting gradle issues. Hide Permalink Amareshwari Sriramadasu added a comment - 26/Aug/11 04:37 Giri, Did you get a chance to look at why publishing to staging area is failing? Kind regards Karl-Heinz Marbaise Hide Permalink Andy Gumbrecht added a comment - 10/Sep/14 18:51 Same for Apache TomEE Access denied to: https://repository.apache.org Show Andy Gumbrecht added a comment - 10/Sep/14 18:51 So either I'm doing something wrong (which might very well be ) or this might be a bug.

The build process specifies the url of the repository. This version is used since ages to also build the release artifacts (see release todo in wiki): [[email protected] ~]$ ls -l ~/.ant/lib/ total 1831 -rw-r--r-- 1 hudson hudson 701049 Jul 27 with no luck... with no luck...

although I do not think this should be necessary (at least according to the docs) Show Brian Fox added a comment - 10/Sep/14 23:12 Something on the ldap server was changed and now reverted. Return code is: 400 [artifact:deploy] BUILD FAILED C:\Users\11_1_15\build.xml:561: The following error occurred while executing this line: C:\Users\11_1_15\build.xml:551: Error deploying artifact 'com.xactsites:shared-resources:war': Error deploying artifact: Failed to transfer file: http://${nexusIP}:8081/nexus/content/groups/public/com/xactsites/shared-resources/13.1.19-SNAPSHOT/shared-resources-13.1.19-20121211.172831-28.war. Show John Sichi added a comment - 06/Oct/11 23:33 After reboot, still hit the PermGen OOM in the middle (this time right after pdk tests).

To reply, visit: https://reviews.apache.org/r/2153/ ----------------------------------------------------------- (Updated 2011-10-07 08:08:55.722617) Review request for hive and John Sichi. https://issues.gradle.org/browse/GRADLE-2254 This version is used since ages to also build the release artifacts (see release todo in wiki): [[email protected] ~]$ ls -l ~/.ant/lib/ total 1831 -rw-r--r-- 1 hudson hudson 701049 Jul 27 Why don't most major game engines use gifs for animated textures? 100 Prisoners and a clock Plural of "State of the Union" When people brag about their abilities and belittle their s-in-place Top anh795 Newbie Posts: 2 Joined: Fri Apr 18, 2014 6:07 am Re: An error has occurred while processing the Maven artifact ta Quote Postby anh795 » Mon Apr 21,

Show Amareshwari Sriramadasu added a comment - 26/Aug/11 04:37 Giri, Did you get a chance to look at why publishing to staging area is failing? http://svbuckeye.com/an-error/an-error-has-occurred-during-the-processing-of-your-request.php Show Carl Steinbach added a comment - 04/Oct/11 21:49 @John: Which version of Ant are you using? Diagnosis: Error deploying artifact 'org.apache.tapestry:plastic:jar': Error deploying artifact: Authorization failed: Access denied to: https://repository.apache.org/service/local/staging/deploy/maven2/org/apache/tapestry/plastic/5.4-beta-21/plastic-5.4-beta-21.jar :plastic:uploadPublished FAILED :plastic:uploadPublished (Thread[main,5,main]) completed. the last official release is still 2.1.3 and on the website I see no way to download the snapshot version. –radlan Nov 9 '15 at 11:09 Here's one location:

I wrote a book and am getting offers for to publish. It also looks like we should be pushing this to the staging repository as opposed to the releases repository. I took another look at the Apache "Publishing Maven Artifacts" guide (http://www.apache.org/dev/publishing-maven-artifacts.html) and think that we're probably failing to include a couple fields that are required in the pom files. this contact form for artifact: com.mycompany:site:war:1.0 from the specified remote repositories: central (http://repo1.maven.org/maven2), public snapshots (http://nexus.broadleafcommerce.org/nexus/content/repositories/snapshots/), public releases (http://nexus.broadleafcommerce.org/nexus/content/repositories/releases/) Total time: 5 seconds MadeInChina commented Aug 14, 2013 Fix this by change

https://issues.apache.org/jira/browse/HIVE-2243 Diffs build-common.xml 9a738c9 build.xml 13b09c1 contrib/build.xml cf1711c hbase-handler/build.xml 4990b13 ql/build.xml ca8ba86 Diff: https://reviews.apache.org/r/2153/diff Testing ------- Verified that I can publish maven artifacts to the snapshot and staging repos. I have a fix for this issue on my machine, but not yet committed it, since I have not yet created a unit test for this. I'll test more combinations tomorrow.

This is the ant target that is run:

Return code is: 400 For some reason beyond my understanding, maven is trying to deploy to the public repository (not allowed by nexus) instead of the snapshot repository specified (note the I'll leave this issue open until all of the nightly Hudson builds have succeeded (hopefully that will happen tonight). Another "gotcha" is that the Maven tasks will make use of the standard Maven settings file, located in your "$HOME/.m2/settings.xml" file. We recommend upgrading to the latest Safari, Google Chrome, or Firefox.

Essentially, if the M2/M2_HOME environment variables are set as specified here, then the remote repository url is overwritten with that from our settings.xml file and uses the mirror that is set The nexus logs suggest that the incoming request is different between the two (where one specifies the snapshot repository and the other the public repository) so I want to pin this Verified that the jar, package, and test targets still work. http://svbuckeye.com/an-error/an-error-has-occurred-while-processing-report.php Verified that the jar, package, and test targets still work.

This addresses bug HIVE-2243 . Verified that the jar, package, and test targets still work. Should I include him as author? https://issues.apache.org/jira/browse/HIVE-2243 Diffs (updated) ant/build.xml 17b3c3a build-common.xml 9a738c9 build.xml 13b09c1 cli/build.xml add53e1 common/build.xml e8a0712 contrib/build.xml cf1711c hbase-handler/build.xml 4990b13 hwi/build.xml 76bffa8 jdbc/build.xml 9d9a59e metastore/build.xml 7f01f91 odbc/build.xml db9f4af pdk/build.xml b1f6ed4 ql/build.xml ca8ba86 serde/build.xml 51ac8dd

Religious supervisor wants to thank god in the acknowledgements more hot questions question feed lang-xml about us tour help blog chat data legal privacy policy work here advertising info mobile contact So, if someone wants to make a patch that fixes this issue so it works on both 1.7 and 1.8, I think it would be a good thing. There are some warnings and errors about missing artifacts, but the JARs are built correctly - so not fatal - that was always the case and we dont want to touch Show Howard M.

Export Tools GradleGRADLE-2254Maven Plugin uploads certain artifacts twiceLog In ExportXMLWordPrintable Details Type: Bug Status: Resolved Resolution: Fixed Affects Version/s: None Fix Version/s: 1.1-rc-1 Gradle Forums topic Reference: problem - Maven Plugin Thanks Carl! I've double-checked that your beryx user id has deployer access to net.sourceforge.rapidprops. How do I directly display a man page?

We have had many reported Jira tickets about this now, thanks for this one which contains further info, we are looking into it. more stack exchange communities company blog Stack Exchange Inbox Reputation and Badges sign up log in tour help Tour Start here for a quick overview of the site Help Center Detailed Tried this morning and it worked. Show Steve Rowe added a comment - 22/Nov/10 13:50 Hi Drew, I tried running ant generate-maven-artifacts without your patch, and I see the same failure as you do. (Actually, when I

Please note that I had to move several taskdefs from build-common.xml to build.xml in order to avoid OOM errors. Can't publish maven release artifacts to apache repository (Carl Steinbach via jvs) jvs : http://svn.apache.org/viewcvs.cgi/?root=Apache-SVN&view=rev&rev=1181187 Files : /hive/trunk/ant/build.xml /hive/trunk/build-common.xml /hive/trunk/build.xml /hive/trunk/cli/build.xml /hive/trunk/common/build.xml /hive/trunk/contrib/build.xml /hive/trunk/hbase-handler/build.xml /hive/trunk/hwi/build.xml /hive/trunk/jdbc/build.xml /hive/trunk/metastore/build.xml /hive/trunk/odbc/build.xml /hive/trunk/pdk/build.xml /hive/trunk/ql/build.xml /hive/trunk/serde/build.xml