Home > Altiris Error > Altiris Error Incorrect Function

Altiris Error Incorrect Function

Contents

If joining a workgroup choose another workgroup name. [ERROR_DUP_NAME (0x34)]Error Code 53: The network path was not found. [ERROR_BAD_NETPATH (0x35)]Error Code 54: The network is busy. [ERROR_NETWORK_BUSY (0x36)]Error Code 55: The The registry could not read in or write out or flush one of the files that contain the system's image of the registry. [ERROR_REGISTRY_IO_FAILED (0x3F8)]Error Code 1017: The system has attempted jdean, Mar 29, 2005 #18 (You must log in or sign up to reply here.) Show Ignored Content Share This Page Tweet Your name or email address: Password: Forgot your password? Please try to save this file elsewhere. [ERROR_LOST_WRITEBEHIND_DATA_NETWORK_SERVER_ERROR (0x315)]Error Code 790: {Delayed Write Failed} Windows was unable to save all the data for the file %hs; the data has been lost. http://svbuckeye.com/altiris-error/altiris-error-4.php

More details may be available in Windows Event log.Start Program / ApplicationRun DOS / Cmd CommandStart TaskIf you have any questions, please do not hesitate to contact our support team.Solutions Simple I hope not, I run DS with a service account with admin rights to the entire OU. error 1 is definately some type of error in the script. Indicates that the application has been launched on a Desktop to which current user has no access rights.

Altiris Error 1603

rio, Mar 17, 2005 #4 Amador New Member Error 1 normally means that there is a syntax problem with the script or job you are trying to run. Applies to: Patch Configuration Failure, Incorrect Function, Unknown Error Code: 2359302 Keywords: Unknown Error Code: 2359302, Incorrect Function, Patch Configuration Fails Unable to resolve this issue? Indicates that command, application name or path has been misspelled when configuring the Action.3221225477
0xC0000005
-1073741819Access violation.Indicates that the executed program has terminated abnormally or crashed.3221225495
0xC0000017
-1073741801Not enough virtual memory is available.Indicates Insert %2 (Volume Serial Number: %3) into drive %1. [ERROR_WRONG_DISK (0x22)]Error Code 36: Too many files opened for sharing. [ERROR_SHARING_BUFFER_EXCEEDED (0x24)]Error Code 38: Reached the end of the file. [ERROR_HANDLE_EOF (0x26)]Error

Please check the system eventlog for additional information. [ERROR_MCA_OCCURED (0x28B)]Error Code 652: There was error [%2] processing the driver database. [ERROR_DRIVER_DATABASE_ERROR (0x28C)]Error Code 653: System hive size has exceeded its limit. You may choose OK to terminate the process [ERROR_DEBUG_ATTACH_FAILED (0x24E)]Error Code 591: {Fatal System Error} The %hs system process terminated unexpectedly with a status of 0x%08x (0x%08x 0x%08x). Without the "" it reads the space as an end of line. Altiris Error 3010 I'd say 90% of my vbscript failures are directly attributed to syntax error.

Selecting NO may cause the application to operate incorrectly. [ERROR_BAD_DLL_ENTRYPOINT (0x261)]Error Code 610: {Invalid Service Callback Entrypoint} The %hs service is not written correctly. With the "", it runs beautifully. Tel : +1-888-720-9500 Email : [email protected] Speak to us Join the Desktop Central Community, to get instant answers for your queries, register with our Forum. Close Login Didn't find the article you were looking for?

Submit a Threat Submit a suspected infected fileto Symantec. Altiris Error 1619 The file has been replaced with the signed file. Selecting OK will cause the service to continue operation. Some data might have been lost. [ERROR_REGISTRY_HIVE_RECOVERED (0x2AD)]Error Code 686: The application is attempting to run executable code from the module %hs.

Altiris Error 1603 During Script Execution

The application will not run properly. https://www.manageengine.com/products/desktop-central/patch_configuration_failure_2359302.html Please enter a valid email address. Altiris Error 1603 Create a SymAccount now!' Deployment Job failed with "Incorrect function" TECH139044 September 21st, 2010 http://www.symantec.com/docs/TECH139044 Support / Deployment Job failed with "Incorrect function" Did this article resolve your issue? Altiris Error Codes Cause The installation process gets quit abruptly due to one or more of the following reasons: Shutdown / log off has been called while the installation is in progress.

Terms and Rules Febooti SoftwareHome News Products Download Buy Support Contacts» Automation Workshop home Online help Screenshots Tutorials Quick tour FAQ Buy now DownloadProgram exit codesRun DOS / Cmd command this contact form Select OK to set current directory to %hs [ERROR_BAD_CURRENT_DIRECTORY (0x2BF)]Error Code 704: {Redundant Read} To satisfy a read request [ERROR_FT_READ_RECOVERY_FROM_BACKUP (0x2C0)]Error Code 705: {Redundant Write} To satisfy a write request [ERROR_FT_WRITE_RECOVERY Error can indicate a bug in the executed software that causes stack overflow, leading to abnormal termination of the software.3762507597
0xE0434F4D
-532459699Unhandled exception in .NET application. Help Forums Forums Quick Links Search Forums What's New? Altiris Error 1

Please select a password that you have not previously used. [ERROR_PWD_HISTORY_CONFLICT (0x269)]Error Code 618: The specified compression format is unsupported. [ERROR_UNSUPPORTED_COMPRESSION (0x26A)]Error Code 619: The specified hardware profile configuration is invalid. Trusted by Download Live Demo Compare Editions Free Edition Buy Now Company News Company Customers PitStop Partner Portal Select YES to fail the DLL load. http://svbuckeye.com/altiris-error/altiris-error-52.php To use all processors the operating system restricts itself to the features of the least capable processor in the system.

Shadrach, Mar 25, 2005 #15 LordofthePatch Site Administrator Shadrach said: ...Furthermore, what needs to be explained is that Altiris is displaying the return code from what was run, not generating the Altiris Error 1618 Cause You will encounter this error if you had already installed the patch in the client machine(s) and have failed to reboot them. PC Support Computer Troubleshooting Guides for Common Errors and Symptoms How-To's & Tutorials Getting Support: Tech Support & Computer Repair Help Software Tools for Testing, Monitoring, and Fixing Computers Testing and

United States Products Threat Protection Information Protection Cyber Security Services Website Security Small Business CustomerOne Products A-Z Services Business Critical Services Consulting Services Customer Success Services Cyber Security Services Education Services

Another possible cause is that either gdi32.dll or user32.dll has failed to initialize.3221226505
0xC0000409
-1073740791Stack buffer overflow / overrun. We have confirmed, in Windows 7 (Build 7600), at least following two steps set a -ve value. (Trying the same in Vista fails) Configuring network parameters setting using "netsh" allows a For example our Adobe Reader 7 install looks like this: "\\Appsaltirisds\express\Library\Packages\Applications\Adobe_Reader\Adobe 7.0\Adobe Reader 7.0.msi" /qn Without the "" it errors out and returns a code of 1. Altiris Error 2 The callback entrypoint should be declared as WINAPI or STDCALL.

Verify the functionality of silent switches, such that there is no intervention/pop-up in the User Interface while installing the application in one computer. Please try to save this file elsewhere. [ERROR_LOST_WRITEBEHIND_DATA (0x254)]Error Code 597: The parameter(s) passed to the server in the client/server shared memory window were invalid. Please choose a longer password. [ERROR_PWD_TOO_SHORT (0x267)]Error Code 616: The policy of your user account does not allow you to change passwords too frequently. Check This Out You can also use the 8.3 standard on local files/folders (not sure about shares).

ERROR_TOO_MANY_OPEN_FILES 5, Access is denied. Hibernation will be disabled until the system is restarted. [ERROR_HIBERNATION_FAILURE (0x290)]Error Code 665: The requested operation could not be completed due to a file system limitation [ERROR_FILE_SYSTEM_LIMITATION (0x299)]Error Code 668: An Before opening files in this location, you must first add the web site to your trusted sites list, browse to the web site and select the option to login automatically. [ERROR_FORMS_AUTH_REQUIRED LordofthePatch, Mar 24, 2005 #12 cfrandall New Member To be clear for those looking for Altiris-specific info, the error codes in the list that Jeremy was kind enough to post are