Home > Altiris Error > Altiris Error Codes

Altiris Error Codes

1621 ERROR_INSTALL_UI_FAILURE There was an error starting the Windows Installer service user interface.

Contents

The first attachment is for Altiris 6.X Error Codes, nicely categorized by sheetsand the explanationsandwill cover the following: DS Firm Errors DS RapiDeploy Errors DS PXE Errors DS AClient Errors DS This does not include installs where the ForceReboot action is run. You break IT, I fix IT! 0 Login to vote ActionsLogin or register to post comments andykn101 Altiris / Microsoft Error Codes and Descriptions - Comment:27 Sep 2011 : Link KB At this point, it is up to over 20,000 words and counting =) Let me know what you think and/or if you have anything you would like to add, questions or have a peek at this web-site

One I'm baffled about is: {Cannot delete file: C:\...Altiris Agent\Software Delivery\{xxx}\cache\AClient.exe. Join a real-time chat and ask the experts. This spreadsheet lists all the … […] Ben T Says: July 28th, 2016 at 1:30 am Hey Rich, just found myself needing to redownload this. You must install a Windows service pack that contains a newer version of the Windows Installer service. 1638 ERROR_PRODUCT_VERSION Another version of this product is already installed.

Altiris Error 1603

Learn More Ghost Solution Suite 3.0 - "How-to" Videos We have created several "How To" videos and posted links on this page. Beheben Altiris Deployment Solution Fehler 1 Während Der Skriptausführung Says: March 18th, 2015 at 3:03 am […] Altiris Error Codes | Richard Parmiter – This spreadsheet lists all the Altiris Deployment Verify that the patch package exists and that you can access it, or contact the application vendor to verify that this is a valid Windows Installer patch package. 1636 ERROR_PATCH_PACKAGE_INVALID Consult the Windows Installer SDK for detailed command line help. 3010 ERROR_SUCCESS_REBOOT_REQUIRED A restart is required to complete the install.

resmoore, Mar 31, 2005 #1 TNeumann SR Technical Acct Manager There is a 4+MB file in this thread for Error Codes. resmoore, Mar 31, 2005 #3 TNeumann SR Technical Acct Manager Only took a few minutes That's why we have the best Altiris forum out there...people actually respond to posts. We will add more as they become available. Altiris Error 1 During Script Execution Explanation: The program was unable to write data to the first sector on the hard disk.

Stay logged in Altirigos Home Forums > Notification Server and Solutions > Notification Server > Home Home Quick Links Recent Activity What's New? Possible cause: This may be caused by a BIOS setting that prevents programmatic access to the boot sector (see the CMOS setup). Thanks again. check my blog Verify that the specified log file location exists and is writable. 1623 ERROR_INSTALL_LANGUAGE_UNSUPPORTED This language of this installation package is not supported by your system. 1624 ERROR_INSTALL_TRANSFORM_FAILURE Error applying

This is a piece of work I had really put in a 10 year career effort into updating as the years go by so consider this a great document to get Altiris Error 3010 theone97, Dec 5, 2006 #6 Brandon Active Member This is a link to an article in the Altiris Knowledgebase. This return code is for the DataStore component. resmoore New Member Hi all, Does anyone know of / have a document that explains what the altiris error codes mean?

Altiris Deployment Console Error Codes

Style Altirigos Contact Us Home Top RSS Forum software by XenForo™ ©2011 XenForo Ltd. The link Nick provided helped out. Altiris Error 1603 Contact the application vendor to verify that this is a valid Windows Installer patch package. 1637 ERROR_PATCH_PACKAGE_UNSUPPORTED This patch package cannot be processed by the Windows Installer service. Altiris Error Code 1619 Verify that the package exists and that you can access it, or contact the application vendor to verify that this is a valid Windows Installer package. 1620 ERROR_INSTALL_PACKAGE_INVALID This installation

Anyway, if anyone knows of an error codes cheat-sheet, I'd love to see it. Check This Out Discussion in 'Notification Server' started by resmoore, Mar 31, 2005. mpahuta, Jul 14, 2006 #1 Nick Altiris/AppSense Guru These are typically standard Windows exit/error codes. mpahuta, Jul 15, 2006 #3 LordofthePatch Site Administrator Is it one of those standard error codes, or is more similar to something like this: -21456345? Altiris Ds Error Codes

Return ErrorID Code 1000 IDS_ERR_SETUP_INSTALL 1001 IDS_ERR_COPYING_LICEN SE 1002 IDS_ERR_SETUP_INSTALL 1003 IDS_ERR_GRANT_LOGON Error Description This return code is for the DataStore component. Hope all is well mate, Ben Leave a Reply Name (required) Mail (will not be published) (required) Website CAPTCHA Code* Ads Categories Altiris Applications Appsense Citrix Certification Citrix Access Gateway Citrix ERROR The requested URL could not be retrieved The following error was encountered while trying to retrieve the URL: http://0.0.0.10/ Connection to 0.0.0.10 failed. Source The exit codes that I'm looking for are the ones displayed uner the 'run history' tab on the package and task properties window.

Help Forums Forums Quick Links Search Forums What's New? Altiris Error 1618 Your cache administrator is webmaster. Learn More Richard Parmiter Virtualisation blog and Knowledge Base Contact About Downloads You are here: Home Altiris Error Codes Home Contact About Downloads Altiris Error Codes Posted on August 8th, 2008

Contact the application vendor to verify that this is a valid Windows Installer package. 1621 ERROR_INSTALL_UI_FAILURE There was an error starting the Windows Installer service user interface.

I am sure this could be of one of the greatest values to you, considering I use this multiple times a day! Entries (RSS)Comments (RSS)Profile Tags .NET .NET FrameWork Active Directory Altiris Apple Automation Manager Citrix Dell Delphi Excel Exchange Exchange2003 Exchange2010 Hack HP iOS Java LinkedIn Linux Lync MSI Office Office 2010 Error Codes 451 Previous page Next page 1...449450451452453 Related Manuals for SYMANTEC ALTIRIS DEPLOYMENT SOLUTION 6.9 SP4 - V1.0 SYMANTEC ALTIRIS 6 INVENTORY SOLUTION Datasheet (2 pages) SYMANTEC DEPLOYMENT SOLUTION Altiris Error 2 NS SP3 R6, the 6.5 Console, DS 6.8 and Task Servers.

Contact your system administrator. 1626 ERROR_FUNCTION_NOT_CALLED Function could not be executed. 1627 ERROR_FUNCTION_FAILED Function failed during execution. 1628 ERROR_INVALID_TABLE Invalid or unknown table specified. 1629 ERROR_DATATYPE_MISMATCH Data It consists of 49 pages and covers 0 through 14000+ error codes. Login or Register to post your comment. http://svbuckeye.com/altiris-error/altiris-error-53.php Print This PagePrint ShareShare Url of this page: HTML Link: Bookmark Manuals Brands SYMANTEC Manuals Other ALTIRIS DEPLOYMENT SOLUTION 6.9 SP4 - V1.0 Manual SYMANTEC ALTIRIS DEPLOYMENT SOLUTION 6.9 SP4 -

Generated Fri, 30 Sep 2016 04:56:13 GMT by s_hv995 (squid/3.5.20) Verify that the specified transform paths are valid. 1625 ERROR_INSTALL_PACKAGE_REJECTED This installation is forbidden by system policy. Connect Etiquette: Please "Mark as Solution" posts that fix your problem. +1 Login to vote ActionsLogin or register to post comments Would you like to reply? The code was listed in the c:\Program Files\Altiris\Altiris Agent\Logs directory in the file agent.log.

Help Forums Forums Quick Links Search Forums What's New? Don't show me this message again. LordofthePatch said: Is it one of those standard error codes, or is more similar to something like this: -21456345? Authorised Symantec Consultant (ASC) with Endpoint Management Limited, an Authorised Symantec Delivery Provider based in the UK.

The Deployment Solution Installer returns error codes whenever it encounters any problems while installing. Access is denied. (Replace XXX with long GUID). This message is indicative of a success.To prevent the reboot we can pass REBOOT=ReallySurpress to the MSI but we still need to indicate to Altirs that 3010 actually means Success and I genuinely appreciate the xls file.

Terms and Rules Remko Weijnen's Blog (Remko's Blog)About Virtualization, VDI, SBC, Application Compatibility and anything else I feel likeHomeDownloadsAbout Remko Weijnen and this blogContactMaster Return codes in Altiris Author: Remko Didn't want to upload it here. Even though the article references the same error code, I am not using Patch Management. The possible error codes are:Error codeDescription0Success1460Timeout3010Success, reboot required40001USER_ERROR_CANNOT_OPEN_LOG_FILE40003USER_ERROR_CANNOT_INITIALIZE_APPLICATION40004USER_ERROR_OLD_OS_VERSION40005USER_ERROR_WRONG_PLATFORM40006USER_ERROR_BAD_SPVERSION40007USER_ERROR_MISSING_REQUIRED_PREREQUISITE40008USER_ERROR_IE_GREATERVERSION_INSTALLED40010USER_ERROR_BAD_LANGUAGE40012USER_ERROR_CRYPTO_VALIDATION_FAILED40013USER_ERROR_ALREADY_INSTALLED40015USER_ERROR_WRONG_OS40016USER_ERROR_EXTRACTION_FAILED40019USER_ERROR_WINDOWS_PRERELEASE_NOT_SUPPORTED40021USER_ERROR_UNSUPPORTED_VIDEO_HARDWARE40022USER_ERROR_UNSUPPORTED_VIDEO_DRIVER40023USER_ERROR_PREREQUISITE_INSTALL_FAILED40024USER_ERROR_NEUTRAL_CAB_DOWNLOAD_FAILED40025USER_ERROR_NEUTRAL_CAB_INSTALL_FAILED41001USER_ERROR_UNKNOWN50005USER_SUCCESS_USER_CANCELLED Feedback Contribute Share Is this page helpful?

To print the manual completely, please, download it. This signifies an error opening the setup INI file. I'm seeing a couple of priority 1 items for {EventRouter:: DeliverPostData caught unexpected exception} and lots of priority 2 events. Popular Windows Dev Center Microsoft Azure Microsoft Visual Studio Office Dev Center asp.net IIS.net Learning Resources Channel 9 Windows Development Videos Microsoft Virtual Academy Programs App Developer Agreement Windows Insider Program

Created and staffed by volunteer Altiris admins, the IRC #Altiris chat room is your place for solutions. theone97, Dec 5, 2006 #8 (You must log in or sign up to reply here.) Show Ignored Content Share This Page Tweet Your name or email address: Password: Forgot your password? Please ensure that the temp directory on the remote computer has at least 100MB free space. Complete that installation before proceeding with this install.. 1619 ERROR_INSTALL_PACKAGE_OPEN_FAILED This installation package could not be opened.