Home > Altiris Error > Alteris Error

Alteris Error

1634 ERROR_INSTALL_NOTUSED Component not used on this machine. 1635 ERROR_PATCH_PACKAGE_OPEN_FAILED This patch package could not be opened.

Contents

Email Address (Optional) Your feedback has been submitted successfully! I am sure this could be of one of the greatest values to you, considering I use this multiple times a day! error 1 is definately some type of error in the script. Information Technology Contact Me Altiris: Fix Error 1618: Another Installation Is Already In Progress I'm still stuck using Altiris 6.9DS.  It works, but it's also finicky.  I often run into error http://svbuckeye.com/altiris-error/alteris-error-code.php

This had taken years of both Google searching as well as vendor communications to get it to be as accurate as possible. Run the job on the workstation and u should see the error in the script. Contact your support personnel. 1611 ERROR_INDEX_ABSENT Component qualifier not present. 1612 ERROR_INSTALL_SOURCE_ABSENT The installation source for this product is not available. In one instance we had to reboot the server after deleting these reg keys.    You might also wish to save this command and run it as a batch file. Discover More

Altiris Server Error Download

Not a domain user), you will need to update the account to the new name. As Amador states, make sure you use double quotes when there are spaces in folder and/or file names. I can look tomorrow, though. This signifies an error in opening the setup INI file.

For example our Adobe Reader 7 install looks like this: "\\Appsaltirisds\express\Library\Packages\Applications\Adobe_Reader\Adobe 7.0\Adobe Reader 7.0.msi" /qn Without the "" it errors out and returns a code of 1. cosimo You can log batch or cmd jobs also. Yeah that's dos or batch. Error -2147024809 During Script Execution LordofthePatch, Mar 24, 2005 #10 jdean Altiris Engineer (Super Mod) clfrnacwby said: I second this motion, as I have run into this a few times.

This signifies an error opening the setup INI file. The first attachment is for Altiris 6.X Error Codes, nicely categorized by sheetsand the explanationsandwill cover the following: DS Firm Errors DS RapiDeploy Errors DS PXE Errors DS AClient Errors DS Either syntax, permission to the file or files or the file or files doesn't exist. This error occurs while copying the license file to the remote computer.

Substitute the appropriate domain, username and password into the syntax below and run this command in the DOS window:             AeXConfig.exe /svcid user: password:   In some Altiris Deployment Console Error Codes This return code is for the Deployment Server component. If the problem persists, see your local network administrator. Contact the application vendor to verify that this is a valid Windows Installer patch package. 1637 ERROR_PATCH_PACKAGE_UNSUPPORTED This patch package cannot be processed by the Windows Installer service.

Altiris Error 1 During Script Execution

rio, Mar 17, 2005 #7 jdean Altiris Engineer (Super Mod) rio said: Thank you very much. http://jacobsalmela.com/altiris-fix-error-1618-another-installation-is-already-in-progress/ Start this service on the server and reload the console.   The account used for either the "Altiris Service" or the Notification Server webs is incorrect, disabled or the password for Altiris Server Error Download Create another service account, get the AD SID. Altiris Error 3010 On the Notification Server computer, run "C:\Program Files\Altiris\Notification Server\bin\AeXConfig.exe /svcid user:(user name) password:(password)]", substituting the correct installation path if a non-default location was used, to provide a new account.    The

Verify that the temp folder exists and that you can write to it. 1633 ERROR_INSTALL_PLATFORM_UNSUPPORTED This installation package is not supported on this platform. Run the job on the workstation and u should see the error in the script. It may be syntax related or something else (file not found). LordofthePatch, Mar 24, 2005 #12 cfrandall New Member To be clear for those looking for Altiris-specific info, the error codes in the list that Jeremy was kind enough to post are Altiris Error Code 1603

This error occurs while setting up the installation on a remote computer. Contact your support personnel. 1622 ERROR_INSTALL_LOG_FAILURE Error opening installation log file. Registry modifications should only be carried-out by persons experienced in the use of the registry editor application. jdean, Mar 24, 2005 #11 LordofthePatch Site Administrator It is actually when you specify the script to be run.

Print This PagePrint ShareShare Url of this page: HTML Link: Bookmark Manuals Brands SYMANTEC Manuals Other ALTIRIS DEPLOYMENT SOLUTION 6.9 SP4 - V1.0 Manual SYMANTEC ALTIRIS DEPLOYMENT SOLUTION 6.9 SP4 - Altiris Error 1603 It may be syntax related or something else (file not found). There is no trace of an error 42, happening while downloading a disk image!

Contact your application vendor. 1634 ERROR_INSTALL_NOTUSED Component not used on this machine. 1635 ERROR_PATCH_PACKAGE_OPEN_FAILED This patch package could not be opened.

Without the "" it reads the space as an end of line. No Yes How can we make this article more helpful? altiris-error-codes.xls -------------------------------------- Tags: Altiris, error, error codes, spreadsheet, xls Filed under Altiris | 8 Responses to "Altiris Error Codes" Jim Says: August 9th, 2008 at 4:05 am really useful, thanks Chris Altiris Error 40008 jdean, Mar 29, 2005 #18 (You must log in or sign up to reply here.) Show Ignored Content Share This Page Tweet Your name or email address: Password: Forgot your password?

This spreadsheet lists all the … […] Beheben Altiris Deployment Lösung Fehler 1618 Says: March 18th, 2015 at 3:57 am […] Altiris Error Codes | Richard Parmiter – This spreadsheet lists To configure or remove the existing version of this product, use Add/Remove Programs on the Control Panel. 1639 ERROR_INVALID_COMMAND_LINE Invalid command line argument. Great care should be taken when making changes to a Windows registry. I second this motion, as I have run into this a few times.

To get to the Windows schedules, go to 'Start' > 'Control Panel' > 'Scheduled Tasks'.    If you have hierarchy set up, you will need to remove and re-add the renamed Possible cause: This may be caused by a BIOS setting that prevents programmatic access to the boot sector (see the CMOS setup). No Yes Did this article save you the trouble of contacting technical support?