Home > Altiris Deployment > Altiris Deployment Console Error 3010

Altiris Deployment Console Error 3010

Contents

Missing Internet Explorer Maintenance settings for Internet Explorer 11 Missing the Compatibility View Button Deploy pinned websites using Microsoft Deployment Toolkit (MDT) 2013 IE11 Frequently Asked Questions (FAQ) Guide for IT Experts Exchange Miscellaneous How to change your primary email address Video by: Kyle Hi everyone! Foran January 30, 2013 21:42 Ah, got it. ERROR_INSTALL_TRANSFORM_REJECTED 3010 A reboot is required to complete the install. http://svbuckeye.com/altiris-deployment/altiris-deployment-error-3010.php

In cases like this, you can simply add this code to your Success Codes field. Tuser, Sep 12, 2005 #4 (You must log in or sign up to reply here.) Show Ignored Content Share This Page Tweet Your name or email address: Password: Forgot your password? If you have any questions, then please Write a Comment below! ERROR_INSTALL_TRANSFORM_FAILURE 1625 This installation is forbidden by system policy. https://support.symantec.com/en_US/article.TECH12314.html

Altiris Deployment Solution 6.9 Web Console

Submit a request 9 Comments Date Votes 0 Joseph D. Reboot3. Verify that the temp folder exists and that you can write to it.

ERROR_UNKNOWN_FEATURE 1607 Component ID not registered. Matt Barber Application Specialist TN User Group Marketing Director 0 Login to vote ActionsLogin or register to post comments Would you like to reply? ERROR_INSTALL_LOG_FAILURE 1623 This language of this installation package is not supported by your system. Altiris Deployment Solution 7.1 Training Any ideas?

Marking as installed and quitting... & EXIT 9:REM Unsupported OS outside of DSM requirements.VER | FIND " 6.1.7600" >NULIF %ERRORLEVEL%==0 ECHO Win7-Srv2012R2 requires SP1 for this IE version. Altiris Deployment Solution Download Verify that the patch package exists and that you can access it, or contact the application vendor to verify that this is a valid Windows Installer patch package. regedit /s C:\temp\Uninstall SAV 8\regchange.reg MsiExec.exe /x{0EFC6259-3AD8-4CD2-BC57-D4937AF5CC0E} /qn In Altiris, I first copy the "regchange.reg" file to the local hard drive (C:\temp\Uninstall SAV 8\regchange.reg) on the workstation, then I Marking as failed and quitting... & EXIT 14VER | FIND "6.2." >NULIF %ERRORLEVEL%==0 ECHO Win8-Srv2012 does NOT support this IE version.

First we a folder where we will place our Master Return code jobs, I named this folder Ret.In the Ret Folder add a job named 3010 and add a Power Control Altiris Deployment Solution Alternative When I run this, Altiris returns the "Error 3010 during script execution" error. 0 Question by:mgraham78 Facebook Twitter LinkedIn Google LVL 51 Best Solution byNetman66 Error 3010 is simply a return ERROR_FUNCTION_NOT_CALLED 1627 Function failed during execution. No reboot needed in between.I install directly the IE11 exe, without customization.Like • Show 1 Like1 Actions Ratfink Dec 17, 2014 1:56 PMMark CorrectCorrect AnswerIts looking like my workstations might be

Altiris Deployment Solution Download

Foran January 30, 2013 17:00 Ran through the deployment on !7x64sp1, fully patched as of 1/30/12 and received 327426. http://www.altirigos.com/forums/threads/return-code-3010.1500/ If Windows Installer determines a product may be incompatible with the current operating system, it displays a dialog informing the user and asking whether to try to install anyway. Altiris Deployment Solution 6.9 Web Console ERROR_PATCH_PACKAGE_REJECTED 1644 One or more customizations are not permitted by system policy. Altiris Deployment Solution 6.9 Sp5 Download According to this site Prerequisite updates for Internet Explorer 11 there are a bunch.

ERROR_UNKNOWN_PROPERTY 1609 Handle is in an invalid state. this contact form Join Now For immediate help use Live now! I used this article as a reference: http://www.ca.com/us/support/ca-support-online/product-content/knowledgebase-articles/tec535980.aspx A couple of notes on this. The possible error codes are:Error codeDescription0Success1460Timeout3010Success, reboot required40001USER_ERROR_CANNOT_OPEN_LOG_FILE40003USER_ERROR_CANNOT_INITIALIZE_APPLICATION40004USER_ERROR_OLD_OS_VERSION40005USER_ERROR_WRONG_PLATFORM40006USER_ERROR_BAD_SPVERSION40007USER_ERROR_MISSING_REQUIRED_PREREQUISITE40008USER_ERROR_IE_GREATERVERSION_INSTALLED40010USER_ERROR_BAD_LANGUAGE40012USER_ERROR_CRYPTO_VALIDATION_FAILED40013USER_ERROR_ALREADY_INSTALLED40015USER_ERROR_WRONG_OS40016USER_ERROR_EXTRACTION_FAILED40019USER_ERROR_WINDOWS_PRERELEASE_NOT_SUPPORTED40021USER_ERROR_UNSUPPORTED_VIDEO_HARDWARE40022USER_ERROR_UNSUPPORTED_VIDEO_DRIVER40023USER_ERROR_PREREQUISITE_INSTALL_FAILED40024USER_ERROR_NEUTRAL_CAB_DOWNLOAD_FAILED40025USER_ERROR_NEUTRAL_CAB_INSTALL_FAILED41001USER_ERROR_UNKNOWN50005USER_SUCCESS_USER_CANCELLED Feedback Contribute Share Is this page helpful? Altiris Deployment Solution Vs Sccm

Verify that the specified transform paths are valid. Changes will not be effective until the system is rebooted. ERROR_INSTALL_FAILURE 1604 Installation suspended, incomplete. have a peek here I'm wondering if this is because of the built in Windows Defender service...  0 Shane Corellian January 30, 2013 17:14 Hi Joseph, Do you see any Forefront files or directories on

How long did the deployment run before returning 327426? Altiris Deployment Solution 7.1 User Guide With 37 hours of learning, this training will explain concrete processes for increasing efficiency and limiting wasted time and effort. This error code is available with Windows Installer versions 2.0 or later.

Was this article helpful? 1 out of 1 found this helpful Have more questions?

Close Login Didn't find the article you were looking for? Control Panel showed no software installed. ERROR_DATATYPE_MISMATCH 1630 Data of this type is not supported. Altiris Deployment Solution 7.5 Training I'll dig up the script and post it here either way if I can find it.

Here is an example:REM Installing Hotfix MS03-026\\ServerName\express\server\common\packages\hotfix\q823980\q823980w2k.exe /u /z /qif ERRORLEVEL 3010 goto successif ERRORLEVEL 0 goto successgoto failure:successset %ERRORLEVEL% = 0goto end:failure echo FailedEXIT 1#goto end:end Legacy ID 19275 ERROR_INVALID_PARAMETER 120 This function is only available for Win 2000 and Windows XP with Windows Installer v2.0. Related articles Package Other Error How Can I Find Applications that Were Installed in the Last Few Days on Target Machines? Check This Out Provide feedback on this article Request Assistance Print Article Products Subscribe to this Article Manage your Subscriptions Search Again Situation A Scripted install returns Error 3010 in Deployment Server, Patch Management

ERROR_INDEX_ABSENT 1612 The installation source for this product is not available. One lucky winner will receive 500 Connect points! * Take the survey. Supported Products A-Z Get support for your product, with downloads, knowledge base articles, documentation, and more. ERROR_UNKNOWN_PRODUCT 1606 Feature ID not registered.

Complete that installation before proceeding with this install. Solved Trying to run script using Altiris... ERROR_PATCH_PACKAGE_UNSUPPORTED 1638 Another version of this product is already installed. Yes No Additional feedback? 1500 characters remaining Submit Skip this Thank you!

Stay logged in Altirigos Home Forums > Notification Server and Solutions > Notification Server > Home Home Quick Links Recent Activity What's New? ERROR_SUCCESS_REBOOT_REQUIREDd Article Filed Under: Endpoint Management, Wise Packaging, Configuring Login or register to post comments Comments RSS Feed Comments 2 Comments • Jump to latest comment WiseUser Windows Installer Exit / Run the uninistall and reboot. (MsiExec.exe /x {0EFC6259-3AD8-4CD2-BC57-D4937AF5CC0E} REMOVE=ALL /qn /forcerestart) 0 Write Comment First Name Please enter a first name Last Name Please enter a last name Email After bringing the image back up, I disabled UAC, redployed, and got the same error.

It didn't appear installed, and on reboot I confirmed that it did not install. if errorlevel 1 goto ERROR goto END :ERROR if errorlevel 3010 goto SUCCESS goto END :SUCCESS SET %ERRORLEVEL% = 0 goto END :END I just have to fully test it now,